[lfs-support] error regarding chapter 6.13 binutils

Yida Zhang yidazh at gmail.com
Mon Sep 10 20:03:59 PDT 2012


Hi, Guys

I have encountered the same problem. But it seems that mine is more
serious. Please see the output of the make -k check as follows:

=== ld tests ===

Schedule of variations:
unix

Running target unix
Using /tools/share/dejagnu/baseboards/unix.exp as board description file
for target.
Using /tools/share/dejagnu/config/unix.exp as generic interface file for
target.
Using /sources/binutils-2.22/ld/testsuite/config/default.exp as
tool-and-target-specific interface file.
Running /sources/binutils-2.22/ld/testsuite/ld-alpha/alpha.exp ...
Running /sources/binutils-2.22/ld/testsuite/ld-arm/arm-elf.exp ...
Running /sources/binutils-2.22/ld/testsuite/ld-auto-import/auto-import.exp
...
Running /sources/binutils-2.22/ld/testsuite/ld-bootstrap/bootstrap.exp ...
FAIL: bootstrap
FAIL: bootstrap with strip
FAIL: bootstrap with --traditional-format
FAIL: bootstrap with --no-keep-memory
FAIL: bootstrap with --relax
Running /sources/binutils-2.22/ld/testsuite/ld-cdtest/cdtest.exp ...
FAIL: cdtest
FAIL: cdtest with -Ur
Running /sources/binutils-2.22/ld/testsuite/ld-checks/checks.exp ...
Running /sources/binutils-2.22/ld/testsuite/ld-cris/cris.exp ...
Running /sources/binutils-2.22/ld/testsuite/ld-crx/crx.exp ...
Running /sources/binutils-2.22/ld/testsuite/ld-cygwin/exe-export.exp ...
Running /sources/binutils-2.22/ld/testsuite/ld-d10v/d10v.exp ...
Running /sources/binutils-2.22/ld/testsuite/ld-discard/discard.exp ...
Running /sources/binutils-2.22/ld/testsuite/ld-elf/audit.exp ...
Running /sources/binutils-2.22/ld/testsuite/ld-elf/binutils.exp ...
FAIL: strip -z max-page-size=0x200000 (maxpage1)
FAIL: strip -z max-page-size=0x200000 -z common-page-size=0x100000
(maxpage1)
FAIL: strip -z max-page-size=0x100000 (maxpage1)
FAIL: strip -z max-page-size=0x100000 -z common-page-size=0x1000 (maxpage1)
FAIL: strip (maxpage1)
FAIL: strip -shared (maxpage1)
FAIL: objcopy (maxpage1)
FAIL: objcopy -shared (maxpage1)
FAIL: strip -z relro (relro1)
FAIL: strip -z relro -shared (relro1)
FAIL: objcopy -z relro (relro1)
FAIL: objcopy -z relro -shared (relro1)
FAIL: strip -z relro -shared (relro2)
FAIL: objcopy -z relro -shared (relro2)
FAIL: strip -T /sources/binutils-2.22/ld/testsuite/ld-elf/lma.lnk (lma)
FAIL: objcopy (tdata1)
FAIL: objcopy -z relro (tdata1)
FAIL: objcopy -shared (tdata1)
FAIL: objcopy -shared -z relro (tdata1)
FAIL: objcopy -z max-page-size=0x100000 (tdata1)
FAIL: objcopy -z max-page-size=0x100000 -z common-page-size=0x1000 (tdata1)
FAIL: objcopy (tdata2)
FAIL: objcopy -z relro (tdata2)
FAIL: objcopy -shared (tdata2)
FAIL: objcopy -shared -z relro (tdata2)
FAIL: objcopy -z max-page-size=0x100000 (tdata2)
FAIL: objcopy -z max-page-size=0x100000 -z common-page-size=0x1000 (tdata2)
FAIL: objcopy (tdata3)
FAIL: objcopy -z relro (tdata3)
FAIL: objcopy -shared (tdata3)
FAIL: objcopy -shared -z relro (tdata3)
FAIL: objcopy -z max-page-size=0x100000 (tdata3)
FAIL: objcopy -z max-page-size=0x100000 -z common-page-size=0x1000 (tdata3)
FAIL: objcopy (tbss1)
FAIL: objcopy -z relro (tbss1)
FAIL: objcopy -shared (tbss1)
FAIL: objcopy -shared -z relro (tbss1)
FAIL: objcopy -z max-page-size=0x100000 (tbss1)
FAIL: objcopy -z max-page-size=0x100000 -z common-page-size=0x1000 (tbss1)
FAIL: objcopy (tbss2)
FAIL: objcopy -z relro (tbss2)
FAIL: objcopy -shared (tbss2)
FAIL: objcopy -shared -z relro (tbss2)
FAIL: objcopy -z max-page-size=0x100000 (tbss2)
FAIL: objcopy -z max-page-size=0x100000 -z common-page-size=0x1000 (tbss2)
FAIL: objcopy (tbss3)
FAIL: objcopy -z relro (tbss3)
FAIL: objcopy -shared (tbss3)
FAIL: objcopy -shared -z relro (tbss3)
FAIL: objcopy -z max-page-size=0x100000 (tbss3)
FAIL: objcopy -z max-page-size=0x100000 -z common-page-size=0x1000 (tbss3)
Running /sources/binutils-2.22/ld/testsuite/ld-elf/compress.exp ...
FAIL: Run normal with libfoo.so with compressed debug sections
Running /sources/binutils-2.22/ld/testsuite/ld-elf/dwarf.exp ...
FAIL: Run with libdwarf1.so first
FAIL: Run with libdwarf1.so last
FAIL: Strip -s libdwarf1c.so
Running /sources/binutils-2.22/ld/testsuite/ld-elf/eh-group.exp ...
Running /sources/binutils-2.22/ld/testsuite/ld-elf/elf.exp ...
FAIL: preinit array
FAIL: init array
FAIL: fini array
FAIL: init array mixed
FAIL: PIE preinit array
FAIL: PIE init array
FAIL: PIE fini array
FAIL: PIE init array mixed
FAIL: static preinit array
FAIL: static init array
FAIL: static fini array
FAIL: static init array mixed
Running /sources/binutils-2.22/ld/testsuite/ld-elf/exclude.exp ...
Running /sources/binutils-2.22/ld/testsuite/ld-elf/frame.exp ...
Running /sources/binutils-2.22/ld/testsuite/ld-elf/sec-to-seg.exp ...
Running /sources/binutils-2.22/ld/testsuite/ld-elf/sec64k.exp ...
Running /sources/binutils-2.22/ld/testsuite/ld-elf/shared.exp ...
FAIL: Run normal with libfoo.so
FAIL: Run protected with libfoo.so
FAIL: Run hidden with libfoo.so
FAIL: Run normal with versioned libfoo.so
FAIL: Run warn with versioned libfoo.so
FAIL: Run protected with versioned libfoo.so
FAIL: Run hidden with versioned libfoo.so
FAIL: Run normal libbar.so with libfoo.so
FAIL: Run protected libbar.so with libfoo.so
FAIL: Run hidden libbar.so with libfoo.so
FAIL: Run normal libbar.so with versioned libfoo.so
FAIL: Run protected libbar.so with versioned libfoo.so
FAIL: Run hidden libbar.so with versioned libfoo.so
FAIL: Run dl1a with --dynamic-list=dl1.list and dlopen on libdl1.so
FAIL: Run dl1b with --dynamic-list-data and dlopen on libdl1.so
FAIL: Run with libdl2a.so
FAIL: Run with libdl2b.so
FAIL: Run with libdl2c.so
FAIL: Run with libdl4a.so
FAIL: Run with libdl4b.so
FAIL: Run with libdl4c.so
FAIL: Run with libdl4d.so
FAIL: Run with libdl4e.so
FAIL: Run with libdl4f.so
FAIL: Run dl6a1 with --dynamic-list-data and dlopen on libdl6a.so
FAIL: Run dl6a2 with -Bsymbolic-functions and dlopen on libdl6a.so
FAIL: Run dl6a3 with -Bsymbolic and dlopen on libdl6a.so
FAIL: Run dl6a4 with -Bsymbolic --dynamic-list-data and dlopen on libdl6a.so
FAIL: Run dl6a5 with -Bsymbolic-functions --dynamic-list-cpp-new and dlopen
on libdl6a.so
FAIL: Run dl6a6 with --dynamic-list-cpp-new -Bsymbolic-functions and dlopen
on libdl6a.so
FAIL: Run dl6a7 with --dynamic-list-data -Bsymbolic and dlopen on libdl6a.so
FAIL: Run dl6b1 with --dynamic-list-data and dlopen on libdl6b.so
FAIL: Run dl6b2 with dlopen on libdl6b.so
FAIL: Run dl6c1 with --dynamic-list-data and dlopen on libdl6c.so
FAIL: Run dl6d1 with --dynamic-list-data and dlopen on libdl6d.so
FAIL: Run with libdata1.so
FAIL: Run with libfunc1.so comm1.o
FAIL: Run with comm1.o libfunc1.so
FAIL: Run with pr11138-2.c libpr11138-1.so
FAIL: Run with libpr11138-1.so pr11138-2.c
FAIL: Run with pr13250-3.c, libpr13250-1.so and libpr13250-2.so
FAIL: Run with libdl3a.so
FAIL: Run with libdl3c.so
FAIL: Run with libnew1a.so
FAIL: Run with libnew1b.so
Running /sources/binutils-2.22/ld/testsuite/ld-elf/tls_common.exp ...
Running /sources/binutils-2.22/ld/testsuite/ld-elf/wrap.exp ...
FAIL: Run with libwrap1a.so and libwrap1b.so
FAIL: Run with libwrap1b.so and libwrap1a.so
Running /sources/binutils-2.22/ld/testsuite/ld-elfcomm/elfcomm.exp ...
Running /sources/binutils-2.22/ld/testsuite/ld-elfvers/vers.exp ...
FAIL: ar with versioned solib
Running /sources/binutils-2.22/ld/testsuite/ld-elfvsb/elfvsb.exp ...
FAIL: visibility (hidden_normal)
FAIL: visibility (hidden_normal) (PIC main)
FAIL: visibility (hidden_weak)
FAIL: visibility (hidden_weak) (PIC main)
FAIL: visibility (protected)
FAIL: visibility (protected) (PIC main)
FAIL: visibility (protected_undef_def)
FAIL: visibility (protected_undef_def) (PIC main)
FAIL: visibility (protected_weak)
FAIL: visibility (protected_weak) (PIC main)
FAIL: visibility (normal)
FAIL: visibility (normal) (PIC main)
Running /sources/binutils-2.22/ld/testsuite/ld-elfweak/elfweak.exp ...
Running /sources/binutils-2.22/ld/testsuite/ld-fastcall/fastcall.exp ...
Running /sources/binutils-2.22/ld/testsuite/ld-frv/fdpic.exp ...
Running /sources/binutils-2.22/ld/testsuite/ld-frv/frv-elf.exp ...
Running /sources/binutils-2.22/ld/testsuite/ld-frv/tls.exp ...
Running /sources/binutils-2.22/ld/testsuite/ld-gc/gc.exp ...
Running /sources/binutils-2.22/ld/testsuite/ld-h8300/h8300.exp ...
Running /sources/binutils-2.22/ld/testsuite/ld-i386/i386.exp ...
Running /sources/binutils-2.22/ld/testsuite/ld-ia64/ia64.exp ...
Running /sources/binutils-2.22/ld/testsuite/ld-ia64/line.exp ...
Running /sources/binutils-2.22/ld/testsuite/ld-ifunc/binutils.exp ...
FAIL: strip (ifunc-4-x86)
FAIL: objcopy (ifunc-4-x86)
FAIL: strip (ifunc-4-local-x86)
FAIL: objcopy (ifunc-4-local-x86)
Running /sources/binutils-2.22/ld/testsuite/ld-ifunc/ifunc.exp ...
Running /sources/binutils-2.22/ld/testsuite/ld-libs/libs.exp ...
Running /sources/binutils-2.22/ld/testsuite/ld-linkonce/linkonce.exp ...
Running /sources/binutils-2.22/ld/testsuite/ld-m68hc11/m68hc11.exp ...
Running /sources/binutils-2.22/ld/testsuite/ld-m68k/m68k-got.exp ...
Running /sources/binutils-2.22/ld/testsuite/ld-m68k/m68k.exp ...
Running /sources/binutils-2.22/ld/testsuite/ld-mep/mep.exp ...
Running /sources/binutils-2.22/ld/testsuite/ld-mips-elf/mips-elf-flags.exp
...
Running /sources/binutils-2.22/ld/testsuite/ld-mips-elf/mips-elf.exp ...
Running /sources/binutils-2.22/ld/testsuite/ld-misc/defsym.exp ...
Running /sources/binutils-2.22/ld/testsuite/ld-mmix/mmix.exp ...
Running /sources/binutils-2.22/ld/testsuite/ld-mn10300/mn10300.exp ...
Running /sources/binutils-2.22/ld/testsuite/ld-pe/pe-compile.exp ...
Running /sources/binutils-2.22/ld/testsuite/ld-pe/pe-run.exp ...
Running /sources/binutils-2.22/ld/testsuite/ld-pe/pe-run2.exp ...
Running /sources/binutils-2.22/ld/testsuite/ld-pe/pe.exp ...
Running /sources/binutils-2.22/ld/testsuite/ld-pie/pie.exp ...
FAIL: weak undefined
FAIL: weak undefined data
Running /sources/binutils-2.22/ld/testsuite/ld-plugin/plugin.exp ...
Running /sources/binutils-2.22/ld/testsuite/ld-powerpc/aix52.exp ...
Running /sources/binutils-2.22/ld/testsuite/ld-powerpc/powerpc.exp ...
Running /sources/binutils-2.22/ld/testsuite/ld-s390/s390.exp ...
Running /sources/binutils-2.22/ld/testsuite/ld-scripts/align.exp ...
Running /sources/binutils-2.22/ld/testsuite/ld-scripts/alignof.exp ...
Running /sources/binutils-2.22/ld/testsuite/ld-scripts/assert.exp ...
Running /sources/binutils-2.22/ld/testsuite/ld-scripts/crossref.exp ...
Running /sources/binutils-2.22/ld/testsuite/ld-scripts/data.exp ...
Running /sources/binutils-2.22/ld/testsuite/ld-scripts/default-script.exp
...
Running /sources/binutils-2.22/ld/testsuite/ld-scripts/defined.exp ...
Running /sources/binutils-2.22/ld/testsuite/ld-scripts/dynamic-sections.exp
...
Running /sources/binutils-2.22/ld/testsuite/ld-scripts/empty-address.exp ...
Running /sources/binutils-2.22/ld/testsuite/ld-scripts/empty-aligned.exp ...
Running /sources/binutils-2.22/ld/testsuite/ld-scripts/empty-orphan.exp ...
Running /sources/binutils-2.22/ld/testsuite/ld-scripts/expr.exp ...
Running /sources/binutils-2.22/ld/testsuite/ld-scripts/extern.exp ...
Running /sources/binutils-2.22/ld/testsuite/ld-scripts/include.exp ...
Running /sources/binutils-2.22/ld/testsuite/ld-scripts/map-address.exp ...
Running /sources/binutils-2.22/ld/testsuite/ld-scripts/overlay-size.exp ...
Running /sources/binutils-2.22/ld/testsuite/ld-scripts/phdrs.exp ...
Running /sources/binutils-2.22/ld/testsuite/ld-scripts/phdrs2.exp ...
Running /sources/binutils-2.22/ld/testsuite/ld-scripts/phdrs3.exp ...
Running /sources/binutils-2.22/ld/testsuite/ld-scripts/provide.exp ...
Running /sources/binutils-2.22/ld/testsuite/ld-scripts/rgn-at.exp ...
Running /sources/binutils-2.22/ld/testsuite/ld-scripts/rgn-over.exp ...
Running /sources/binutils-2.22/ld/testsuite/ld-scripts/script.exp ...
Running /sources/binutils-2.22/ld/testsuite/ld-scripts/section-flags.exp ...
Running /sources/binutils-2.22/ld/testsuite/ld-scripts/section-match.exp ...
Running /sources/binutils-2.22/ld/testsuite/ld-scripts/size.exp ...
Running /sources/binutils-2.22/ld/testsuite/ld-scripts/sizeof.exp ...
Running /sources/binutils-2.22/ld/testsuite/ld-scripts/sort.exp ...
Running /sources/binutils-2.22/ld/testsuite/ld-scripts/weak.exp ...
Running /sources/binutils-2.22/ld/testsuite/ld-selective/sel-dump.exp ...
Running /sources/binutils-2.22/ld/testsuite/ld-selective/selective.exp ...
Running /sources/binutils-2.22/ld/testsuite/ld-sh/arch/arch.exp ...
Running /sources/binutils-2.22/ld/testsuite/ld-sh/rd-sh.exp ...
Running /sources/binutils-2.22/ld/testsuite/ld-sh/sh-vxworks.exp ...
Running /sources/binutils-2.22/ld/testsuite/ld-sh/sh.exp ...
Running /sources/binutils-2.22/ld/testsuite/ld-sh/sh64/rd-sh64.exp ...
Running /sources/binutils-2.22/ld/testsuite/ld-sh/sh64/relax.exp ...
Running /sources/binutils-2.22/ld/testsuite/ld-sh/sh64/relfail.exp ...
Running /sources/binutils-2.22/ld/testsuite/ld-sh/sh64/sh64.exp ...
Running /sources/binutils-2.22/ld/testsuite/ld-shared/shared.exp ...
FAIL: shared
FAIL: shared -Bsymbolic
FAIL: shared (PIC main)
Running /sources/binutils-2.22/ld/testsuite/ld-sparc/sparc.exp ...
Running /sources/binutils-2.22/ld/testsuite/ld-spu/spu.exp ...
Running /sources/binutils-2.22/ld/testsuite/ld-srec/srec.exp ...
Running /sources/binutils-2.22/ld/testsuite/ld-tic6x/tic6x.exp ...
Running /sources/binutils-2.22/ld/testsuite/ld-tilegx/tilegx.exp ...
Running /sources/binutils-2.22/ld/testsuite/ld-tilepro/tilepro.exp ...
Running /sources/binutils-2.22/ld/testsuite/ld-undefined/entry.exp ...
Running /sources/binutils-2.22/ld/testsuite/ld-undefined/undefined.exp ...
Running /sources/binutils-2.22/ld/testsuite/ld-undefined/weak-undef.exp ...
Running /sources/binutils-2.22/ld/testsuite/ld-unique/unique.exp ...
Running /sources/binutils-2.22/ld/testsuite/ld-v850/v850.exp ...
Running /sources/binutils-2.22/ld/testsuite/ld-versados/versados.exp ...
Running /sources/binutils-2.22/ld/testsuite/ld-vxworks/vxworks.exp ...
Running /sources/binutils-2.22/ld/testsuite/ld-x86-64/dwarfreloc.exp ...
Running /sources/binutils-2.22/ld/testsuite/ld-x86-64/line.exp ...
Running /sources/binutils-2.22/ld/testsuite/ld-x86-64/x86-64.exp ...
Running /sources/binutils-2.22/ld/testsuite/ld-xc16x/xc16x.exp ...
Running /sources/binutils-2.22/ld/testsuite/ld-xstormy16/xstormy16.exp ...
Running /sources/binutils-2.22/ld/testsuite/ld-xtensa/coalesce.exp ...
Running /sources/binutils-2.22/ld/testsuite/ld-xtensa/lcall.exp ...
Running /sources/binutils-2.22/ld/testsuite/ld-xtensa/xtensa.exp ...

=== ld Summary ===

# of expected passes 560
# of unexpected failures 143
# of expected failures 61
# of untested testcases 1
/sources/binutils-build/ld/ld-new 2.22

make[5]: *** [check-DEJAGNU] Error 1
make[5]: Leaving directory `/sources/binutils-build/ld'
make[4]: *** [check-am] Error 2
make[4]: Leaving directory `/sources/binutils-build/ld'
make[3]: *** [check-recursive] Error 1
make[3]: Leaving directory `/sources/binutils-build/ld'
make[2]: *** [check] Error 2
make[2]: Leaving directory `/sources/binutils-build/ld'
make[1]: *** [check-ld] Error 2
make[2]: Entering directory `/sources/binutils-build/libiberty'
make[3]: Entering directory `/sources/binutils-build/libiberty/testsuite'
gcc -DHAVE_CONFIG_H -g -O2 -I..
-I../../../binutils-2.22/libiberty/testsuite/../../include -o test-demangle
\
../../../binutils-2.22/libiberty/testsuite/test-demangle.c ../libiberty.a
./test-demangle <
../../../binutils-2.22/libiberty/testsuite/demangle-expected
./test-demangle: 844 tests, 0 failures
gcc -DHAVE_CONFIG_H -g -O2 -I..
-I../../../binutils-2.22/libiberty/testsuite/../../include -DHAVE_CONFIG_H
-I.. -o test-pexecute \
../../../binutils-2.22/libiberty/testsuite/test-pexecute.c ../libiberty.a
./test-pexecute
gcc -DHAVE_CONFIG_H -g -O2 -I..
-I../../../binutils-2.22/libiberty/testsuite/../../include -DHAVE_CONFIG_H
-I.. -o test-expandargv \
../../../binutils-2.22/libiberty/testsuite/test-expandargv.c ../libiberty.a
./test-expandargv
PASS: test-expandargv-0.
PASS: test-expandargv-1.
PASS: test-expandargv-2.
PASS: test-expandargv-3.
PASS: test-expandargv-4.
PASS: test-expandargv-5.
PASS: test-expandargv-6.
make[3]: Leaving directory `/sources/binutils-build/libiberty/testsuite'
make[2]: Leaving directory `/sources/binutils-build/libiberty'
make[1]: Target `check-host' not remade because of errors.
make[1]: Nothing to be done for `check-target'.
make[1]: Leaving directory `/sources/binutils-build'
make: *** [do-check] Error 2
make: Target `check' not remade because of errors.
---------------------------------------------------------------------------

I'm using Gentoo Live DVD to boot an Intel core I3 540 CPU with 4GB DDR3
memory desktop computer and the LFS version I'm trying to build is 7.1.

I've also found out that in the config.log, there are few error lines as
well:

configure:5609: checking for PWL_handle_timeout in -lpwl
configure:5634: gcc -o conftest -g -O2 conftest.c -lpwl -lstdc++ -lm >&5
/tools/lib/gcc/x86_64-unknown-linux-gnu/4.6.2/../../../../x86_64-unknown-linux-gnu/bin/ld:
cannot find -lpwl
collect2: ld returned 1 exit status
configure:5634: $? = 1
configure: failed program was:
| /* confdefs.h */
| #define PACKAGE_NAME ""
| #define PACKAGE_TARNAME ""
| #define PACKAGE_VERSION ""
| #define PACKAGE_STRING ""
| #define PACKAGE_BUGREPORT ""
| #define PACKAGE_URL ""
| #define LT_OBJDIR ".libs/"
| /* end confdefs.h. */
|
| /* Override any GCC internal prototype to avoid an error.
| Use char because int might match the return type of a GCC
| builtin and then its argument prototype would still apply. */
| #ifdef __cplusplus
| extern "C"
| #endif
| char PWL_handle_timeout ();
| int
| main ()
| {
| return PWL_handle_timeout ();
| ;
| return 0;
| }
configure:5643: result: no
configure:5657: checking for version 0.11 (revision 0 or later) of PPL
configure:5674: gcc -c -g -O2 conftest.c >&5
conftest.c:10:19: fatal error: ppl_c.h: No such file or directory
compilation terminated.
configure:5674: $? = 1
configure: failed program was:
| /* confdefs.h */
| #define PACKAGE_NAME ""
| #define PACKAGE_TARNAME ""
| #define PACKAGE_VERSION ""
| #define PACKAGE_STRING ""
| #define PACKAGE_BUGREPORT ""
| #define PACKAGE_URL ""
| #define LT_OBJDIR ".libs/"
| /* end confdefs.h. */
| #include "ppl_c.h"
| int
| main ()
| {
|
| #if PPL_VERSION_MAJOR != 0 || PPL_VERSION_MINOR < 11
| choke me
| #endif
|
| ;
| return 0;
| }
configure:5678: result: no

I've tried to download ppl and compile it since it complains that ppl_c.h
is not found. But when configuring ppl, it complains that there's no GMP
installed, and to install GMP, I need to fix binutils first. It cycles back
again.

This is the first time I'm building a 64 bit LFS. Can anybody shed some
light one this? Thanks.


Regards,

Yida Zhang

-----------------------------------------------------------------------------

2012/4/13 Ken Moffat <zarniwhoop at ntlworld.com>

> On Fri, Apr 13, 2012 at 01:00:33PM +0530, ankit vishwakarma wrote:
> > while performing the make -k check operation the following error occured
> >
> >
> >               === ld Summary ===
> >
> > # of expected passes          598
> > # of unexpected failures      1
> > # of expected failures                5
> > # of unresolved testcases     3
> > /sources/binutils-build/ld/ld-new 2.22
>
>  Whatever failed, the 1 unexpected failure was somewhere before
> this, hopefully marked by a 'FAIL:' message.
> >
> > Does this cause any error shall i continue with the build?
> > Thank You
>
>  If anyone only gets a few failures (in single figures) then I very
> much doubt that anything serious is wrong.  If you have the log, you
> can look for the FAIL message to see which one test failed, and
> google for that message.  Sometimes, different host kernels/distros
> or uncommon processors cause failures.  But that is only worth doing
> for one failure if you are really obsessive ;-)
>
>  One failure is nothing to worry about.  The expected failures and
> unresolved testcases should be ignored.
>
> ĸen
> --
> das eine Mal als Tragödie, das andere Mal als Farce
> --
> http://linuxfromscratch.org/mailman/listinfo/lfs-support
> FAQ: http://www.linuxfromscratch.org/lfs/faq.html
> Unsubscribe: See the above information page
>
-------------- next part --------------
An HTML attachment was scrubbed...
URL: <http://lists.linuxfromscratch.org/pipermail/lfs-support/attachments/20120910/51758f1f/attachment.html>


More information about the lfs-support mailing list