[lfs-support] error in udev in chapter 6.60

ankit vishwakarma ankitvishwakarma0301 at gmail.com
Sat Apr 21 12:14:43 PDT 2012


while issuing the make command in udev chpater 6.60 for lfs 7.1 the
following error results.please provide help



root:/sources/udev-181# make
GEN test/sys/kernel/uevent_seqnum
make --no-print-directory all-recursive
Making all in .
CC src/libudev.lo
CC src/libudev-list.lo
CC src/libudev-util.lo
CC src/libudev-device.lo
CC src/libudev-enumerate.lo
CC src/libudev-monitor.lo
src/libudev-monitor.c: In function 'udev_monitor_receive_device':
src/libudev-monitor.c:654:44: warning: comparison between signed and
unsigned integer expressions [-Wsign-compare]
CC src/libudev-queue.lo
CCLD src/libudev.la
CC src/libudev-util-private.lo
CC src/libudev-device-private.lo
CC src/libudev-queue-private.lo
CCLD src/libudev-private.la
CC src/src_udevadm-udev-event.o
CC src/src_udevadm-udev-watch.o
CC src/src_udevadm-udev-node.o
CC src/src_udevadm-udev-rules.o
CC src/src_udevadm-udev-ctrl.o
CC src/src_udevadm-udev-builtin.o
CC src/src_udevadm-udev-builtin-blkid.o
CC src/src_udevadm-udev-builtin-firmware.o
CC src/src_udevadm-udev-builtin-hwdb.o
CC src/src_udevadm-udev-builtin-input_id.o
CC src/src_udevadm-udev-builtin-kmod.o
src/udev-builtin-kmod.c:30:21: fatal error: libkmod.h: No such file or directory
compilation terminated.
make[2]: *** [src/src_udevadm-udev-builtin-kmod.o] Error 1
make[1]: *** [all-recursive] Error 1
make: *** [all] Error 2


Thank you



More information about the lfs-support mailing list