[lfs-support] error regarding chapter 6.13 binutils

ankit vishwakarma ankitvishwakarma0301 at gmail.com
Fri Apr 13 00:30:33 PDT 2012


while performing the make -k check operation the following error occured


		=== ld Summary ===

# of expected passes		598
# of unexpected failures	1
# of expected failures		5
# of unresolved testcases	3
/sources/binutils-build/ld/ld-new 2.22

make[5]: *** [check-DEJAGNU] Error 1
make[5]: Leaving directory `/sources/binutils-build/ld'
make[4]: *** [check-am] Error 2
make[4]: Leaving directory `/sources/binutils-build/ld'
make[3]: *** [check-recursive] Error 1
make[3]: Leaving directory `/sources/binutils-build/ld'
make[2]: *** [check] Error 2
make[2]: Leaving directory `/sources/binutils-build/ld'
make[1]: *** [check-ld] Error 2
make[2]: Entering directory `/sources/binutils-build/libiberty'
make[3]: Entering directory `/sources/binutils-build/libiberty/testsuite'
gcc -DHAVE_CONFIG_H -g -O2 -I..
-I../../../binutils-2.22/libiberty/testsuite/../../include  -o
test-demangle \
	../../../binutils-2.22/libiberty/testsuite/test-demangle.c ../libiberty.a
./test-demangle < ../../../binutils-2.22/libiberty/testsuite/demangle-expected
./test-demangle: 844 tests, 0 failures
gcc -DHAVE_CONFIG_H -g -O2 -I..
-I../../../binutils-2.22/libiberty/testsuite/../../include
-DHAVE_CONFIG_H -I.. -o test-pexecute \
	../../../binutils-2.22/libiberty/testsuite/test-pexecute.c ../libiberty.a
./test-pexecute
gcc -DHAVE_CONFIG_H -g -O2 -I..
-I../../../binutils-2.22/libiberty/testsuite/../../include
-DHAVE_CONFIG_H -I.. -o test-expandargv \
	../../../binutils-2.22/libiberty/testsuite/test-expandargv.c ../libiberty.a
./test-expandargv
PASS: test-expandargv-0.
PASS: test-expandargv-1.
PASS: test-expandargv-2.
PASS: test-expandargv-3.
PASS: test-expandargv-4.
PASS: test-expandargv-5.
PASS: test-expandargv-6.
make[3]: Leaving directory `/sources/binutils-build/libiberty/testsuite'
make[2]: Leaving directory `/sources/binutils-build/libiberty'
make[1]: Target `check-host' not remade because of errors.
make[1]: Nothing to be done for `check-target'.
make[1]: Leaving directory `/sources/binutils-build'
make: *** [do-check] Error 2
make: Target `check' not remade because of errors.
root:/sources/binutils-build#

Does this cause any error shall i continue with the build?
Thank You



More information about the lfs-support mailing list