fatal udev error make check?

robert mullinrobert at gmail.com
Tue Nov 30 13:18:47 PST 2010


at 6.59. Udev-161
$make check

1 errors occured

FAIL: test/udev-test.pl
==============================================
1 of 1 test failed
Please report to linux-hotplug at vger.kernel.org
==============================================
make[3]: *** [check-TESTS] Error 1
make[2]: *** [check-am] Error 2
make[1]: *** [check-recursive] Error 1
make: *** [check] Error 2

I've stepped back through it four times to catch an operator error.

Any suggestions?

robert



More information about the lfs-support mailing list