5.5. GCC-4.4.3 - Pass 1

Ken Moffat zarniwhoop73 at googlemail.com
Wed Mar 31 09:12:42 PDT 2010


On 31 March 2010 15:31, Raj <munka007 at gmail.com> wrote:
> I am trying to install gcc and while MAKE i am getting this error.
>
> checking dynamic linker characteristics... configure: error: Link tests are not
> allowed after GCC_NO_EXECUTABLES.
> make[1]: *** [configure-target-libstdc++-v3] Error 1
> make[1]: Leaving directory `/mnt/lfs/sources/gcc-build'
> make: *** [all] Error 2
>
> can some one please help me with this.
>
> regards
> Raj
>
 What host system, and in particular which versions of gcc and
binutils are on  the host ?

ĸen
-- 
After tragedy, and farce, "OMG poneys!"



More information about the lfs-support mailing list