5.5. GCC-4.4.3 - Pass 1

Raj munka007 at gmail.com
Wed Mar 31 07:31:10 PDT 2010

I am trying to install gcc and while MAKE i am getting this error.

checking dynamic linker characteristics... configure: error: Link tests are not
allowed after GCC_NO_EXECUTABLES.
make[1]: *** [configure-target-libstdc++-v3] Error 1
make[1]: Leaving directory `/mnt/lfs/sources/gcc-build'
make: *** [all] Error 2

can some one please help me with this. 


More information about the lfs-support mailing list