Errors when running glibc-2.11-1 tests in section 6.9.

Chris Staub chris at beaker67.com
Sun Mar 28 06:38:20 PDT 2010


On 03/28/2010 02:00 AM, jumbophut wrote:
> I have a significant number of errors when testing the build of
> glibc-2.11.1 in section 6.9 of the book.
>
> I would be grateful if people could advise whether these are a problem
> before I go on.
>
> Output of 'grep Error glibc-check-log':
>
> make[2]: *** [/sources/glibc-build/dlfcn/bug-atexit3.out] Error 1
> make[1]: *** [dlfcn/tests] Error 2
> make[2]: [/sources/glibc-build/posix/annexc.out] Error 1 (ignored)
> make[2]: *** [/sources/glibc-build/nptl/tst-cancel24.out] Error 127
> make[1]: *** [nptl/tests] Error 2
> make[2]: *** [/sources/glibc-build/debug/tst-chk4.out] Error 127
> make[2]: *** [/sources/glibc-build/debug/tst-chk5.out] Error 127
> make[2]: *** [/sources/glibc-build/debug/tst-chk6.out] Error 127
> make[2]: *** [/sources/glibc-build/debug/tst-lfschk4.out] Error 127
> make[2]: *** [/sources/glibc-build/debug/tst-lfschk5.out] Error 127
> make[2]: *** [/sources/glibc-build/debug/tst-lfschk6.out] Error 127
> make[1]: *** [debug/tests] Error 2
> make: *** [check] Error 2
>
> Further setup/system information is near the end of this email.
>
> For the first error, the file bug-atexit3.out contains:
>
> dlopen failed: libstdc++.so.6: cannot open shared object file: No such
> file or directory
>
> That library is definitely in /tools/lib, but it's obviously not being
> looked for their by the test script.
>
> For the other errors, the .out files are empty, but there are similar
> comments in glibc-check-log just before the lines with Error in them:
>
> /sources/glibc-build/nptl/tst-cancel24: error while loading shared
> libraries: libstdc++.so.6: cannot open shared object file: No such
> file or directory
> ...
This usually means that you've missed a symlink. What's the output of 
"ls -l /usr/lib"?



More information about the lfs-support mailing list