perl make test error

Anders Bolinder andersbolinder at home.se
Thu May 21 04:39:50 PDT 2009


Hello

im in section 6.26 lfs 6.4

when testing perl i got *** [_test_tty] Error 1
                        Leaving directory /sources/perl-5.10.0
                        *** [test] Error 2
                        Leaving directory /sources/perl-5.10.0
                        *** [test] Error 2

It says Failed 2 tests out of 1385, 99.86% okay.

Is that something to worry about or should i ignore it and go on?
ill searched google but i didnt find anything on it.

/Anders Bolinder




More information about the lfs-support mailing list