lfs 6.4 - 6.9. Glibc test errors

Hassan Zamani hsn.zamani at gmail.com
Wed Jan 28 05:40:09 PST 2009


Hello
I'm in section 6.9 of lfs 6.4, I have made glibc and in the test
section I got the flowing errors from "grep Error glibc-check-log":

make[2]: [/sources/glibc-build/posix/annexc.out] Error 1 (ignored)
make[2]: *** [/sources/glibc-build/rt/tst-cpuclock2.out] Error 1
make[1]: *** [rt/tests] Error 2
make: *** [check] Error 2

are these harmless messages or not, if not what I must do next?

host system is:
Fedora 10
Kernel 2.6.27.5-117.fc10.i686

Hardware:
Memory 2 GB
CPU Intel P4 3.2 GHz



More information about the lfs-support mailing list