Knoppix is missing the patch command

Jonathan Wilkes jancsika at yahoo.com
Fri Dec 18 10:45:30 PST 2009


> Message: 4
> Date: Fri, 18 Dec 2009 01:16:01 -0500
> From: Chris Staub <chris at beaker67.com>
> Subject: Re: Knoppix is missing the patch command
> To: LFS Support List <lfs-support at linuxfromscratch.org>
> Message-ID: <4B2B1E21.3050908 at beaker67.com>
> Content-Type: text/plain; charset=ISO-8859-1;
> format=flowed

[...]

> As noted in the book, it's normal to have a few failures in
> the Glibc 
> testsuite. However I'm not sure if those failures in
> particular are 
> expected, so check with "grep -B3 Error glibc-check-log"
> and look for 
> obvious error messages (or just respond with the output).

Hi Chris,
     Here's the output after running grep as you outlined above.

-Jonathan

	  > /sources/glibc-build/libio/tst-fopenloc.check
/sources/glibc-build/malloc/mtrace /sources/glibc-build/libio/tst-fopenloc.mtrace >> /sources/glibc-build/libio/tst-fopenloc.check
/bin/sh: /sources/glibc-build/malloc/mtrace: No such file or directory
make[2]: *** [/sources/glibc-build/libio/tst-fopenloc.check] Error 127
make[2]: Target `tests' not remade because of errors.
make[2]: Leaving directory `/sources/glibc-2.10.1/libio'
make[1]: *** [libio/tests] Error 2
--
annexc.c:(.text+0x7a): warning: the use of `tmpnam' is dangerous, better use `mkstemp'
/sources/glibc-build/posix/annexc 'gcc' \
	  '-I../csu -I../iconv -I../locale -I../localedata -I../iconvdata -I../assert -I../ctype -I../intl -I../catgets -I../math -I../setjmp -I../signal -I../stdlib -I../stdio-common -I../libio -I../dlfcn -I../malloc -I../string -I../wcsmbs -I../timezone -I../time -I../dirent -I../grp -I../pwd -I../posix -I../io -I../termios -I../resource -I../misc -I../socket -I../sysvipc -I../gmon -I../gnulib -I../wctype -I../manual -I../shadow -I../gshadow -I../po -I../argp -I../crypt -I../nptl -I../resolv -I../nss -I../rt -I../conform -I../debug -I../libidn -I../nptl_db -I../inet -I../hesiod -I../sunrpc -I../nis -I../nscd -I../streams -I../login -I../elf -I../include -I/sources/glibc-build -I../sysdeps/i386/elf -I../nptl/sysdeps/unix/sysv/linux/i386/i686 -I../nptl/sysdeps/unix/sysv/linux/i386 -I../sysdeps/unix/sysv/linux/i386 -I../nptl/sysdeps/unix/sysv/linux -I../nptl/sysdeps/pthread -I../sysdeps/pthread -I../sysdeps/unix/sysv/linux -I../sysdeps/gnu
 -I../sysdeps/unix/common -I../sysdeps/unix/mman -I../sysdeps/unix/inet -I../sysdeps/unix/sysv/i386 -I../nptl/sysdeps/unix/sysv -I../sysdeps/unix/sysv -I../sysdeps/unix/i386 -I../nptl/sysdeps/unix -I../sysdeps/unix -I../sysdeps/posix -I../sysdeps/i386/i686/fpu -I../nptl/sysdeps/i386/i686 -I../sysdeps/i386/i686 -I../sysdeps/i386/i486 -I../nptl/sysdeps/i386/i486 -I../sysdeps/i386/fpu -I../nptl/sysdeps/i386 -I../sysdeps/i386 -I../sysdeps/wordsize-32 -I../sysdeps/ieee754/ldbl-96 -I../sysdeps/ieee754/dbl-64 -I../sysdeps/ieee754/flt-32 -I../sysdeps/ieee754 -I../sysdeps/generic/elf -I../sysdeps/generic -I../nptl  -I..' > /sources/glibc-build/posix/annexc.out
make[2]: [/sources/glibc-build/posix/annexc.out] Error 1 (ignored)
/sources/glibc-build/malloc/mtrace /sources/glibc-build/posix/bug-regex2.mtrace > /sources/glibc-build/posix/bug-regex2-mem
/bin/sh: /sources/glibc-build/malloc/mtrace: No such file or directory
make[2]: *** [/sources/glibc-build/posix/bug-regex2-mem] Error 127
/sources/glibc-build/malloc/mtrace /sources/glibc-build/posix/bug-regex14.mtrace > /sources/glibc-build/posix/bug-regex14-mem
/bin/sh: /sources/glibc-build/malloc/mtrace: No such file or directory
make[2]: *** [/sources/glibc-build/posix/bug-regex14-mem] Error 127
/sources/glibc-build/malloc/mtrace /sources/glibc-build/posix/bug-regex21.mtrace > /sources/glibc-build/posix/bug-regex21-mem
/bin/sh: /sources/glibc-build/malloc/mtrace: No such file or directory
make[2]: *** [/sources/glibc-build/posix/bug-regex21-mem] Error 127
--
	  > /dev/null
/sources/glibc-build/malloc/mtrace /sources/glibc-build/posix/tst-rxspencer.mtrace > /sources/glibc-build/posix/tst-rxspencer-mem
/bin/sh: /sources/glibc-build/malloc/mtrace: No such file or directory
make[2]: *** [/sources/glibc-build/posix/tst-rxspencer-mem] Error 127
/sources/glibc-build/malloc/mtrace /sources/glibc-build/posix/tst-pcre.mtrace > /sources/glibc-build/posix/tst-pcre-mem
/bin/sh: /sources/glibc-build/malloc/mtrace: No such file or directory
make[2]: *** [/sources/glibc-build/posix/tst-pcre-mem] Error 127
/sources/glibc-build/malloc/mtrace /sources/glibc-build/posix/tst-boost.mtrace > /sources/glibc-build/posix/tst-boost-mem
/bin/sh: /sources/glibc-build/malloc/mtrace: No such file or directory
make[2]: *** [/sources/glibc-build/posix/tst-boost-mem] Error 127
/bin/sh -e tst-getconf.sh /sources/glibc-build/ /sources/glibc-build/elf/ ld-linux.so.2
/sources/glibc-build/malloc/mtrace /sources/glibc-build/posix/bug-glob2.mtrace > /sources/glibc-build/posix/bug-glob2-mem
/bin/sh: /sources/glibc-build/malloc/mtrace: No such file or directory
make[2]: *** [/sources/glibc-build/posix/bug-glob2-mem] Error 127
/sources/glibc-build/malloc/mtrace /sources/glibc-build/posix/tst-vfork3.mtrace > /sources/glibc-build/posix/tst-vfork3-mem
/bin/sh: /sources/glibc-build/malloc/mtrace: No such file or directory
make[2]: *** [/sources/glibc-build/posix/tst-vfork3-mem] Error 127
make[2]: Target `tests' not remade because of errors.
make[2]: Leaving directory `/sources/glibc-2.10.1/posix'
make[1]: *** [posix/tests] Error 2
--
GCONV_PATH=/sources/glibc-build/iconvdata LC_ALL=C MALLOC_TRACE=/sources/glibc-build/misc/tst-error1.mtrace  /sources/glibc-build/elf/ld-linux.so.2 --library-path /sources/glibc-build:/sources/glibc-build/math:/sources/glibc-build/elf:/sources/glibc-build/dlfcn:/sources/glibc-build/nss:/sources/glibc-build/nis:/sources/glibc-build/rt:/sources/glibc-build/resolv:/sources/glibc-build/crypt:/sources/glibc-build/nptl /sources/glibc-build/misc/tst-error1 /sources/glibc-build/misc/tst-error1.out > /sources/glibc-build/misc/tst-error1.out
/sources/glibc-build/malloc/mtrace /sources/glibc-build/misc/tst-error1.mtrace > /sources/glibc-build/misc/tst-error1-mem
/bin/sh: /sources/glibc-build/malloc/mtrace: No such file or directory
make[2]: *** [/sources/glibc-build/misc/tst-error1-mem] Error 127
--
GCONV_PATH=/sources/glibc-build/iconvdata LC_ALL=C   /sources/glibc-build/elf/ld-linux.so.2 --library-path /sources/glibc-build:/sources/glibc-build/math:/sources/glibc-build/elf:/sources/glibc-build/dlfcn:/sources/glibc-build/nss:/sources/glibc-build/nis:/sources/glibc-build/rt:/sources/glibc-build/resolv:/sources/glibc-build/crypt:/sources/glibc-build/nptl /sources/glibc-build/misc/tst-clone  > /sources/glibc-build/misc/tst-clone.out
make[2]: Target `tests' not remade because of errors.
make[2]: Leaving directory `/sources/glibc-2.10.1/misc'
make[1]: *** [misc/tests] Error 2
--
gcc -nostdlib -nostartfiles -o /sources/glibc-build/crypt/sha512c-test  -Wl,-dynamic-linker=/lib/ld-linux.so.2   -Wl,-z,combreloc -Wl,-z,relro -Wl,--hash-style=both /sources/glibc-build/csu/crt1.o /sources/glibc-build/csu/crti.o `gcc --print-file-name=crtbegin.o` /sources/glibc-build/crypt/sha512c-test.o /sources/glibc-build/crypt/libcrypt.so  -Wl,-rpath-link=/sources/glibc-build:/sources/glibc-build/math:/sources/glibc-build/elf:/sources/glibc-build/dlfcn:/sources/glibc-build/nss:/sources/glibc-build/nis:/sources/glibc-build/rt:/sources/glibc-build/resolv:/sources/glibc-build/crypt:/sources/glibc-build/nptl /sources/glibc-build/libc.so.6 /sources/glibc-build/libc_nonshared.a -lgcc -Wl,--as-needed -lgcc_s  -Wl,--no-as-needed `gcc --print-file-name=crtend.o` /sources/glibc-build/csu/crtn.o
GCONV_PATH=/sources/glibc-build/iconvdata LC_ALL=C   /sources/glibc-build/elf/ld-linux.so.2 --library-path /sources/glibc-build:/sources/glibc-build/math:/sources/glibc-build/elf:/sources/glibc-build/dlfcn:/sources/glibc-build/nss:/sources/glibc-build/nis:/sources/glibc-build/rt:/sources/glibc-build/resolv:/sources/glibc-build/crypt:/sources/glibc-build/nptl /sources/glibc-build/crypt/sha512c-test  > /sources/glibc-build/crypt/sha512c-test.out
Timed out: killed the child process
make[2]: *** [/sources/glibc-build/crypt/sha512c-test.out] Error 1
--
GCONV_PATH=/sources/glibc-build/iconvdata LC_ALL=C   /sources/glibc-build/elf/ld-linux.so.2 --library-path /sources/glibc-build:/sources/glibc-build/math:/sources/glibc-build/elf:/sources/glibc-build/dlfcn:/sources/glibc-build/nss:/sources/glibc-build/nis:/sources/glibc-build/rt:/sources/glibc-build/resolv:/sources/glibc-build/crypt:/sources/glibc-build/nptl /sources/glibc-build/crypt/sha512test  > /sources/glibc-build/crypt/sha512test.out
make[2]: Target `tests' not remade because of errors.
make[2]: Leaving directory `/sources/glibc-2.10.1/crypt'
make[1]: *** [crypt/tests] Error 2
--
GCONV_PATH=/sources/glibc-build/iconvdata LC_ALL=C   /sources/glibc-build/elf/ld-linux.so.2 --library-path /sources/glibc-build:/sources/glibc-build/math:/sources/glibc-build/elf:/sources/glibc-build/dlfcn:/sources/glibc-build/nss:/sources/glibc-build/nis:/sources/glibc-build/rt:/sources/glibc-build/resolv:/sources/glibc-build/crypt:/sources/glibc-build/nptl /sources/glibc-build/nptl/test-as-const-structsem  > /sources/glibc-build/nptl/test-as-const-structsem.out
/sources/glibc-build/malloc/mtrace /sources/glibc-build/nptl/tst-stack3.mtrace > /sources/glibc-build/nptl/tst-stack3-mem
/bin/sh: /sources/glibc-build/malloc/mtrace: No such file or directory
make[2]: *** [/sources/glibc-build/nptl/tst-stack3-mem] Error 127
--
make[2]: Target `tests' not remade because of errors.
rm /sources/glibc-build/nptl/test-as-const-pthread-pi-defines.c /sources/glibc-build/nptl/test-as-const-structsem.c /sources/glibc-build/nptl/test-as-const-unwindbuf.c /sources/glibc-build/nptl/test-as-const-lowlevelrwlock.c /sources/glibc-build/nptl/test-as-const-pthread-errnos.c /sources/glibc-build/nptl/test-as-const-lowlevelcond.c /sources/glibc-build/nptl/test-as-const-lowlevelrobustlock.c /sources/glibc-build/nptl/test-as-const-lowlevelbarrier.c
make[2]: Leaving directory `/sources/glibc-2.10.1/nptl'
make[1]: *** [nptl/tests] Error 2
--
GCONV_PATH=/sources/glibc-build/iconvdata LC_ALL=C MALLOC_TRACE=/sources/glibc-build/elf/tst-leaks1.mtrace  /sources/glibc-build/elf/ld-linux.so.2 --library-path /sources/glibc-build:/sources/glibc-build/math:/sources/glibc-build/elf:/sources/glibc-build/dlfcn:/sources/glibc-build/nss:/sources/glibc-build/nis:/sources/glibc-build/rt:/sources/glibc-build/resolv:/sources/glibc-build/crypt:/sources/glibc-build/nptl /sources/glibc-build/elf/tst-leaks1  > /sources/glibc-build/elf/tst-leaks1.out
/sources/glibc-build/malloc/mtrace /sources/glibc-build/elf/tst-leaks1.mtrace > /sources/glibc-build/elf/tst-leaks1-mem
/bin/sh: /sources/glibc-build/malloc/mtrace: No such file or directory
make[2]: *** [/sources/glibc-build/elf/tst-leaks1-mem] Error 127
--
	  diff -u ../scripts/data/localplt-i386-linux-gnu.data - > /sources/glibc-build/elf/check-localplt.out
make[2]: Target `tests' not remade because of errors.
make[2]: Leaving directory `/sources/glibc-2.10.1/elf'
make[1]: *** [elf/tests] Error 2
--
scripts/check-local-headers.sh "/usr/include" "/sources/glibc-build/" > /sources/glibc-build/check-local-headers.out
make[1]: Target `check' not remade because of errors.
make[1]: Leaving directory `/sources/glibc-2.10.1'
make: *** [check] Error 2



      




More information about the lfs-support mailing list