Ang: Re: Automake 1.10 make check error section 6.27 LFS 6.3

abolinder at comhem.se abolinder at comhem.se
Thu Apr 10 10:51:02 PDT 2008



>----Ursprungligt meddelande----
>Från: ej.lfs at xs4all.nl
>Datum: 2008/04/09 23:18
>Till: <lfs-support at linuxfromscratch.org>
>Ärende: Re: Automake 1.10 make check error section 6.27 LFS 6.3
>
>Dan Nicholson wrote:
>> On Tue, Apr 8, 2008 at 12:13 PM, abolinder at comhem.se
>> <abolinder at comhem.se> wrote:
>>>  I get this error running make check
>>>
>>>  1 of 566 tests failed
>>>  (38 tests were not run)
>>>
>>>  *** [check-TESTS] Error 1
>>>  Leaving directory /sources/autoconf-1.10/tests
>>>  *** [check-am] Error 2
>>>  Leaving directory /sources/autoconf-1.10/tests
>>>  *** [check-recursive] Error 1
>>>
>>>  i cant figure out how to solve it by my own..is it safe to ignore it and
>>>  continue with building the rest of the system. or can anyone point me in 
the
>>>  right direction of finding whats wrong?
>> 
>> I'd just continue since you probably won't even use automake. However,
>> I can't see what would be wrong since we can't see what test failed.
>> If you can grep the log for "FAIL" or "fail", you'll probably see
>> which test failed in particular.
>> 
>> --
>> Dan
>
>Maybe it is this one:
>http://www.mail-archive.com/bug-automake@gnu.org/msg00979.html
>
>The instsh2.test fails when running the testsuite as root.
>
>Erik-Jan
>
>-- 
>http://linuxfromscratch.org/mailman/listinfo/lfs-support
>FAQ: http://www.linuxfromscratch.org/lfs/faq.html
>Unsubscribe: See the above information page
>

it was the gcj4.test that failed, i find this http://wiki.linuxfromscratch.
org/lfs/ticket/2066 
ill just go ahead and build the rest of the system.

/Anders Bolinder



More information about the lfs-support mailing list