Automake 1.10 make check error section 6.27 LFS 6.3

abolinder at comhem.se abolinder at comhem.se
Tue Apr 8 12:13:18 PDT 2008


Hello

I get this error running make check 

1 of 566 tests failed  
(38 tests were not run)

*** [check-TESTS] Error 1
Leaving directory /sources/autoconf-1.10/tests
*** [check-am] Error 2
Leaving directory /sources/autoconf-1.10/tests
*** [check-recursive] Error 1

i cant figure out how to solve it by my own..is it safe to ignore it and 
continue with building the rest of the system. or can anyone point me in the 
right direction of finding whats wrong?

thanks

/Anders Bolinder



More information about the lfs-support mailing list