lfs-6.3-RC-1 glibc test failures

Frank Ianella vze2gz6q at verizon.net
Wed Jul 25 14:40:17 PDT 2007


hi,

make -k check 2>&1 | tee glibc-check-log' ends before all the tests are run. The following is what is displayed on the command line:

make[1]: Target `check' not remade because of errors.
make[1]: Leaving directory `/sources/glibc-2.5'
make: *** [check] Error 2

running 'grep Error glibc-check-log' produces the following:

root:/sources/glibc-build# grep Error glibc-check-log
make[2]: [/sources/glibc-build/posix/annexc.out] Error 1 (ignored)
make[2]: *** [/sources/glibc-build/nptl/tst-cancel1.out] Error 1
make[1]: *** [nptl/tests] Error 2
make: *** [check] Error 2
        

According to the book, the first two are expected. The third and fourth 
errors and the fact that the test terminated even with the '-k' flag is 
cause for concern. Is it advisable to continue? Any suggestions are 
appreciated.

Thanks


-------------- next part --------------
A non-text attachment was scrubbed...
Name: vze2gz6q.vcf
Type: text/x-vcard
Size: 127 bytes
Desc: not available
URL: <http://lists.linuxfromscratch.org/pipermail/lfs-support/attachments/20070725/48ac509a/attachment.vcf>


More information about the lfs-support mailing list