GCC second pass make error

Steffen H. Larsen helbo15 at gmail.com
Sun Jan 28 08:27:48 PST 2007


well now I get some other error  ^^

so I guess that I've either missed some of the things I read or I'm
pretty bad at typeing what the guide says hehe ^^;
now this error comes to the screen

../../gcc-4.0.2/gcc/crtstuff.c:230: error: parameter '__dso_handle' is
initializes
../../gcc-4.0.2/gcc/crtstuff.c:230: error: redefinition of parameter
'__dso_handle'
 ../../gcc-4.0.2/gcc/crtstuff.c:225: error: previous definition of
'__dso_handle' was here
../../gcc-4.0.2/gcc/crtstuff.c:235: error: storage class specified for
parameter '__exa_finalize'
../../gcc-4.0.2/gcc/crtstuff.c:235: error: weak declaration of
'__exa_finalize'  must be public
../../gcc-4.0.2/gcc/crtstuff.c:258: error: storage class specified for
parameter '__do_global_dtors_aux
../../gcc-4.0.2/gcc/crtstuff.c:258: error: warning: 'used' attribute ignored
../../gcc-4.0.2/gcc/crtstuff.c:258: error: syntax error before '{' token
../../gcc-4.0.2/gcc/crtstuff.c:260: error: storage class specified for
parameter 'completed'
../../gcc-4.0.2/gcc/crtstuff.c:261: error: syntax error before 'func_ptr'
../../gcc-4.0.2/gcc/crtstuff.c:302: error: storage class specified for
parameter 'frame_dummy'
../../gcc-4.0.2/gcc/crtstuff.c:302: error: warning: 'used' attribute ignored
../../gcc-4.0.2/gcc/crtstuff.c:302: error: syntax error before '{' token
make[1]: *** [crtbegin.o] error 1
make[1] Leaving directory '/mnt/hda1/tools/gcc-build/gcc'
make: *** [all-gcc] error 2

again the [all-gcc] error but looks difrent to me ?
is it another error unrelated or related to what I've shown yuo so far ?



More information about the lfs-support mailing list