errors on glibc tests

Pedro Rodrigues de Figueiredo pedrorfigueiredo at sapo.pt
Wed Jan 10 13:43:42 PST 2007


Hi... I'm installing LFS 20061209, and completed chapter 5 without 
problems.  Now, on chapter 6, when running the glibc tests, I got the 
following errors:

make[2]: *** [/sources/glibc-build/libio/tst-fopenloc.check] Error 127
make[1]: *** [libio/tests] Error 2
make[2]: [/sources/glibc-build/posix/annexc.out] Error 1 (ignored)
make[2]: *** [/sources/glibc-build/posix/bug-regex2-mem] Error 127
make[2]: *** [/sources/glibc-build/posix/bug-regex14-mem] Error 127
make[2]: *** [/sources/glibc-build/posix/bug-regex21-mem] Error 127
make[2]: *** [/sources/glibc-build/posix/tst-rxspencer-mem] Error 127
make[2]: *** [/sources/glibc-build/posix/tst-pcre-mem] Error 127
make[2]: *** [/sources/glibc-build/posix/tst-boost-mem] Error 127
make[2]: *** [/sources/glibc-build/posix/bug-glob2-mem] Error 127
make[1]: *** [posix/tests] Error 2
make[2]: *** [/sources/glibc-build/misc/tst-error1-mem] Error 127
make[1]: *** [misc/tests] Error 2
make[2]: *** [/sources/glibc-build/nptl/tst-cancel1.out] Error 1
make[2]: *** [/sources/glibc-build/nptl/tst-stack3-mem] Error 127
make[1]: *** [nptl/tests] Error 2
make[2]: *** [/sources/glibc-build/elf/tst-leaks1-mem] Error 127
make[1]: *** [elf/tests] Error 2
make: *** [check] Error 2

Are theses expected, or is there something wrong?

Thank you,
Pedro




More information about the lfs-support mailing list