Test Error Binutil Chapter 6

Vince Greg projet.m2tnsid at neuf.fr
Fri Oct 20 06:06:08 PDT 2006


Hi,
The ./configure and make for this package are ok but not the test
Thanks a lot


See :


(...)
Running /sources/binutils-2.16.1/ld/testsuite/ld-elfvsb/elfvsb.exp ...
FAIL: visibility (hidden_normal) (non PIC)
FAIL: visibility (hidden_normal) (non PIC, load offset)
FAIL: visibility (hidden_normal) (PIC main, non PIC so)
FAIL: visibility (hidden_weak) (non PIC)
FAIL: visibility (hidden_weak) (non PIC, load offset)
FAIL: visibility (hidden_weak) (PIC main, non PIC so)
FAIL: visibility (protected) (non PIC)
FAIL: visibility (protected) (non PIC, load offset)
FAIL: visibility (protected) (PIC main, non PIC so)
FAIL: visibility (protected_undef_def) (non PIC)
FAIL: visibility (protected_undef_def) (non PIC, load offset)
FAIL: visibility (protected_undef_def) (PIC main, non PIC so)
FAIL: visibility (protected_weak) (non PIC)
FAIL: visibility (protected_weak) (non PIC, load offset)
FAIL: visibility (protected_weak) (PIC main, non PIC so)
FAIL: visibility (normal) (non PIC)
FAIL: visibility (normal) (non PIC, load offset)
FAIL: visibility (normal) (PIC main, non PIC so)
Running /sources/binutils-2.16.1/ld/testsuite/ld-elfweak/elfweak.exp ...
Running /sources/binutils-2.16.1/ld/testsuite/ld-fastcall/fastcall.exp ...
Running /sources/binutils-2.16.1/ld/testsuite/ld-frv/fdpic.exp ...
Running /sources/binutils-2.16.1/ld/testsuite/ld-frv/frv-elf.exp ...
Running /sources/binutils-2.16.1/ld/testsuite/ld-frv/tls.exp ...
Running /sources/binutils-2.16.1/ld/testsuite/ld-h8300/h8300.exp ...
Running /sources/binutils-2.16.1/ld/testsuite/ld-i386/i386.exp ...
Running /sources/binutils-2.16.1/ld/testsuite/ld-ia64/ia64.exp ...
Running /sources/binutils-2.16.1/ld/testsuite/ld-linkonce/linkonce.exp ...
Running /sources/binutils-2.16.1/ld/testsuite/ld-m68hc11/m68hc11.exp ...
Running /sources/binutils-2.16.1/ld/testsuite/ld-maxq/maxq.exp ...
Running /sources/binutils-2.16.1/ld/testsuite/ld-mips-elf/mips-elf-flags.exp
...
Running /sources/binutils-2.16.1/ld/testsuite/ld-mips-elf/mips-elf.exp ...
Running /sources/binutils-2.16.1/ld/testsuite/ld-mmix/mmix.exp ...
Running /sources/binutils-2.16.1/ld/testsuite/ld-pe/pe.exp ...
Running /sources/binutils-2.16.1/ld/testsuite/ld-powerpc/powerpc.exp ...
Running /sources/binutils-2.16.1/ld/testsuite/ld-s390/s390.exp ...
Running /sources/binutils-2.16.1/ld/testsuite/ld-scripts/align.exp ...
Running /sources/binutils-2.16.1/ld/testsuite/ld-scripts/assert.exp ...
Running /sources/binutils-2.16.1/ld/testsuite/ld-scripts/crossref.exp ...
Running /sources/binutils-2.16.1/ld/testsuite/ld-scripts/data.exp ...
Running /sources/binutils-2.16.1/ld/testsuite/ld-scripts/defined.exp ...
Running
/sources/binutils-2.16.1/ld/testsuite/ld-scripts/dynamic-sections.exp ...
Running /sources/binutils-2.16.1/ld/testsuite/ld-scripts/empty-orphan.exp
...
Running /sources/binutils-2.16.1/ld/testsuite/ld-scripts/map-address.exp ...
Running /sources/binutils-2.16.1/ld/testsuite/ld-scripts/overlay-size.exp
...
Running /sources/binutils-2.16.1/ld/testsuite/ld-scripts/phdrs.exp ...
Running /sources/binutils-2.16.1/ld/testsuite/ld-scripts/phdrs2.exp ...
Running /sources/binutils-2.16.1/ld/testsuite/ld-scripts/provide.exp ...
Running /sources/binutils-2.16.1/ld/testsuite/ld-scripts/script.exp ...
Running /sources/binutils-2.16.1/ld/testsuite/ld-scripts/size.exp ...
Running /sources/binutils-2.16.1/ld/testsuite/ld-scripts/sizeof.exp ...
Running /sources/binutils-2.16.1/ld/testsuite/ld-scripts/sort.exp ...
Running /sources/binutils-2.16.1/ld/testsuite/ld-scripts/weak.exp ...
Running /sources/binutils-2.16.1/ld/testsuite/ld-selective/sel-dump.exp ...
Running /sources/binutils-2.16.1/ld/testsuite/ld-selective/selective.exp ...
Running /sources/binutils-2.16.1/ld/testsuite/ld-sh/arch/arch.exp ...
Running /sources/binutils-2.16.1/ld/testsuite/ld-sh/rd-sh.exp ...
Running /sources/binutils-2.16.1/ld/testsuite/ld-sh/sh.exp ...
Running /sources/binutils-2.16.1/ld/testsuite/ld-sh/sh64/rd-sh64.exp ...
Running /sources/binutils-2.16.1/ld/testsuite/ld-sh/sh64/relax.exp ...
Running /sources/binutils-2.16.1/ld/testsuite/ld-sh/sh64/relfail.exp ...
Running /sources/binutils-2.16.1/ld/testsuite/ld-sh/sh64/sh64.exp ...
Running /sources/binutils-2.16.1/ld/testsuite/ld-shared/shared.exp ...
FAIL: shared (non PIC)
FAIL: shared (non PIC, load offset)
FAIL: shared (PIC main, non PIC so)
Running /sources/binutils-2.16.1/ld/testsuite/ld-sparc/sparc.exp ...
Running /sources/binutils-2.16.1/ld/testsuite/ld-srec/srec.exp ...
Running /sources/binutils-2.16.1/ld/testsuite/ld-undefined/undefined.exp ...
Running /sources/binutils-2.16.1/ld/testsuite/ld-undefined/weak-undef.exp
...
Running /sources/binutils-2.16.1/ld/testsuite/ld-v850/v850.exp ...
Running /sources/binutils-2.16.1/ld/testsuite/ld-versados/versados.exp ...
Running /sources/binutils-2.16.1/ld/testsuite/ld-x86-64/x86-64.exp ...
Running /sources/binutils-2.16.1/ld/testsuite/ld-xstormy16/xstormy16.exp ...
Running /sources/binutils-2.16.1/ld/testsuite/ld-xtensa/coalesce.exp ...
Running /sources/binutils-2.16.1/ld/testsuite/ld-xtensa/lcall.exp ...

                === ld Summary ===

# of expected passes            222
# of unexpected failures        21
# of expected failures          4
/sources/binutils-build/ld/ld-new 2.16.1

make[3]: *** [check-DEJAGNU] Error 1
make[3]: Leaving directory `/sources/binutils-build/ld'
make[2]: *** [check-am] Error 2
make[2]: Leaving directory `/sources/binutils-build/ld'
make[1]: *** [check-recursive] Error 1
make[1]: Leaving directory `/sources/binutils-build/ld'
make: *** [check-ld] Error 2






More information about the lfs-support mailing list