Erreur Test GlibC chapter 6

Vince Greg projet.m2tnsid at neuf.fr
Thu Oct 19 07:25:44 PDT 2006


Hi, 
I had this errors by compiling GlibC in chapter6

root:/sources/glibc-build# grep Error glibc-check-log
make[2]: *** [/sources/glibc-build/math/test-float.out] Error 1
make[2]: *** [/sources/glibc-build/math/test-double.out] Error 1
make[2]: *** [/sources/glibc-build/math/test-ifloat.out] Error 1
make[2]: *** [/sources/glibc-build/math/test-idouble.out] Error 1
make[1]: *** [math/tests] Error 2
make[2]: [/sources/glibc-build/posix/annexc.out] Error 1 (ignored)
make[2]: *** [/sources/glibc-build/nptl/tst-clock2.out] Error 1
make[1]: *** [nptl/tests] Error 2
make: *** [check] Error 2

If someone can help me
Thanks




More information about the lfs-support mailing list