error Test DejaGnu Chaper 5

Vince Greg projet.m2tnsid at neuf.fr
Mon Oct 16 11:13:03 PDT 2006


Hello, 
I have errors on Test for DejaGnu in Chapter 5
De ./configure and make install are ok


lfs:/mnt/lfs/sources/dejagnu-1.4.4$ make check
Making check in doc
make[1]: Entering directory `/mnt/lfs/sources/dejagnu-1.4.4/doc'
make[1]: Nothing to be done for `check'.
make[1]: Leaving directory `/mnt/lfs/sources/dejagnu-1.4.4/doc'
make[1]: Entering directory `/mnt/lfs/sources/dejagnu-1.4.4'
make  check-DEJAGNU
make[2]: Entering directory `/mnt/lfs/sources/dejagnu-1.4.4'
cd testsuite ; make check
make[3]: Entering directory `/mnt/lfs/sources/dejagnu-1.4.4/testsuite'
Making check in libdejagnu
make[4]: Entering directory
`/mnt/lfs/sources/dejagnu-1.4.4/testsuite/libdejagnu'
if g++ -DPACKAGE_NAME=\"\" -DPACKAGE_TARNAME=\"\" -DPACKAGE_VERSION=\"\"
-DPACKAGE_STRING=\"\" -DPACKAGE_BUGREPORT=\"\" -DPACKAGE=\"dejagnu\"
-DVERSION=\"1.4.4\"  -I. -I.    -I../.. -g -g -O2 -MT unit.o -MD -MP -MF
".deps/unit.Tpo" \
  -c -o unit.o `test -f 'unit.cc' || echo './'`unit.cc; \
then mv -f ".deps/unit.Tpo" ".deps/unit.Po"; \
else rm -f ".deps/unit.Tpo"; exit 1; \
fi
/tmp/cc8Kj35u.s: Assembler messages:
/tmp/cc8Kj35u.s:2863: Error: unknown pseudo-op: `.weakref'
/tmp/cc8Kj35u.s:2864: Error: unknown pseudo-op: `.weakref'
/tmp/cc8Kj35u.s:2865: Error: unknown pseudo-op: `.weakref'
/tmp/cc8Kj35u.s:2866: Error: unknown pseudo-op: `.weakref'
/tmp/cc8Kj35u.s:2867: Error: unknown pseudo-op: `.weakref'
/tmp/cc8Kj35u.s:2868: Error: unknown pseudo-op: `.weakref'
/tmp/cc8Kj35u.s:2869: Error: unknown pseudo-op: `.weakref'
/tmp/cc8Kj35u.s:2870: Error: unknown pseudo-op: `.weakref'
/tmp/cc8Kj35u.s:2871: Error: unknown pseudo-op: `.weakref'
/tmp/cc8Kj35u.s:2872: Error: unknown pseudo-op: `.weakref'
/tmp/cc8Kj35u.s:2873: Error: unknown pseudo-op: `.weakref'
/tmp/cc8Kj35u.s:2874: Error: unknown pseudo-op: `.weakref'
/tmp/cc8Kj35u.s:2875: Error: unknown pseudo-op: `.weakref'
/tmp/cc8Kj35u.s:2876: Error: unknown pseudo-op: `.weakref'
make[4]: *** [unit.o] Error 1
make[4]: Leaving directory
`/mnt/lfs/sources/dejagnu-1.4.4/testsuite/libdejagnu'
make[3]: *** [check-recursive] Error 1
make[3]: Leaving directory `/mnt/lfs/sources/dejagnu-1.4.4/testsuite'
make[2]: *** [check-DEJAGNU] Error 2
make[2]: Leaving directory `/mnt/lfs/sources/dejagnu-1.4.4'
make[1]: *** [check-am] Error 2
make[1]: Leaving directory `/mnt/lfs/sources/dejagnu-1.4.4'
make: *** [check-recursive] Error 1




More information about the lfs-support mailing list