LFS 6.2 ncurses failure

Peter Ennis peterennis at yahoo.com
Mon Aug 7 18:08:08 PDT 2006


LFS-6.2

6.16 ncurses

I could get past this point is all the PRE versions
and in the last months SVN books, but now it fails.
Nothing shows in config.log and no clear google help.

Any suggestions on how to debug?

Thanks,

Peter


** Building terminfo database, please wait...
Running tic to install /usr/share/terminfo ...

        You may see messages regarding extended capabilities, e.g.,
AX.
        These are extended terminal capabilities which are compiled
        using
                tic -x
        If you have ncurses 4.2 applications, you should read the
INSTALL
        document, and install the terminfo without the -x option.

tic: error while loading shared libraries: libncursesw.so.5: cannot
open shared object file: No such file or directory
? tic could not build /usr/share/terminfo
make[1]: *** [install.data] Error 1
make[1]: Leaving directory `/ncurses-5.5/misc'
make: *** [install] Error 2




More information about the lfs-support mailing list