chap 6.15 coreutilies build, failed

Howard Wang hwang at circadiant.com
Tue Oct 25 11:59:00 PDT 2005


Hi All,

while building core utility from chap 6, I got the following errors:

******
Making all in man
make[2]: Entering directory `/sources/coreutils-5.2.1/man'
Updating man page uname.1
Can't locate POSIX.pm in @INC (@INC contains: /tools/lib/perl5/5.8.6/i686-linux /tools/lib/perl5/5.8.6 /tools/lib/perl5/site_perl/5.8.6/i686-linux /tools/lib/perl5/site_perl/5.8.6 /tools/lib/perl5/site_perl .) at ./help2man line 28.
BEGIN failed--compilation aborted at ./help2man line 28.
make[2]: *** [uname.1] Error 2
make[2]: Leaving directory `/sources/coreutils-5.2.1/man'
make[1]: *** [all-recursive] Error 1
make[1]: Leaving directory `/sources/coreutils-5.2.1'
make: *** [all] Error 2
******

the uname patch has been applied first and tool chain has been adjusted 
earlier from /tools to /usr/bin and /lib, sth else I need to do ?

thanks for the help.

howard





-------------- next part --------------
A non-text attachment was scrubbed...
Name: winmail.dat
Type: application/ms-tnef
Size: 2584 bytes
Desc: not available
URL: <http://lists.linuxfromscratch.org/pipermail/lfs-support/attachments/20051025/97103b33/attachment.bin>


More information about the lfs-support mailing list