Compiling error GCC-3.4.1 Pass 2 LFS-6.0 Chapter 5

Jose Carlos Carrion Plaza jc at um.es
Wed Jun 1 10:55:51 PDT 2005


Platform Notes:

HW=PowerPC G4 eMac
S.O.= LFS-6.0 Live CD

Error description:

The Chapter 5 steps were OK until GCC-3.4.1 pass 2.

At GCC-3.4.1 Pass-2 «make» command aborts with

../../gcc-3.4.1/gcc/unwind-dw2.c: In function `uw_frame_state_for':
../../gcc-3.4.1/gcc/unwind-dw2.c:1022: error: structure has no member\
named `regs'
../../gcc-3.4.1/gcc/unwind-dw2.c:1022: error: structure has no member\
named `regs'
../../gcc-3.4.1/gcc/unwind-dw2.c:1022: error: structure has no member\
named `regs'
../../gcc-3.4.1/gcc/unwind-dw2.c:1022: error: structure has no member
named `regs'
make[2]: *** [libgcc/./unwind-dw2.o] Error 1
make[2]: Leaving directory `/mnt/lfs/src/gcc-build/gcc'
make[1]: *** [smtp-multilib] Error 2
make[1]: Leaving directory `/mnt/lfs/src/gcc-build/gcc'
make: *** [all-gcc] Error 2

«--disable-multilibs» configure switch gives the same error.

Thanks in advance.

José Carlos






More information about the lfs-support mailing list