gcc error?

Jim Gifford lfs at jg555.com
Fri Jan 21 00:06:43 PST 2005


tom wrote:

>I get this error when I try to compile gcc-3.4.3 im running on a
> mandrake 8.2 distro
>
>i used the following make BOOT_LDFLAGS="-static" bootstrap
>
>
>
>In file included from /usr/include/signal.h:358,
>                 from ../../gcc-3.4.3/gcc/config/i386/linux.h:217,
>                 from ./tm.h:11,
>                 from ../../gcc-3.4.3/gcc/libgcc2.c:43:
>/usr/include/bits/sigthread.h:36: error: storage class specified for
>parameter `type name'
>make[3]: *** [libgcc/./_muldi3.o] Error 1
>make[3]: Leaving directory `/mnt/lfs/sources/gcc-build/gcc'
>make[2]: *** [libgcc.a] Error 2
>make[2]: Leaving directory `/mnt/lfs/sources/gcc-build/gcc'
>make[1]: *** [stage1_build] Error 2
>make[1]: Leaving directory `/mnt/lfs/sources/gcc-build/gcc'
>make: *** [bootstrap] Error 2
>
>
>
>
>
>  
>
I will assume this is a chapter 5 gcc, I suggest that you go back to 
adjusting the toolchain and run the missing command after the sed.


-- 
------
jim at linuxfromscratch.org
lfs at jg555.com

LFS User # 2577
Registered Linux User # 299986

FWD: 275410
IPKall: 360-968-1517




More information about the lfs-support mailing list