Object: test results on Binutils-2.14

Tristan de Couasnon t.decouasnon at free.fr
Tue Jan 18 14:22:54 PST 2005


I am trying to build LFS from version 5.1.1 book
Using Suse 9.1 environment.
And ..I 'm a newbie 

I reached now my trial number 7 up to Chapter 6.
Until there, I solved myself interesting issues as 
Seeming corrupted Glibc file in one mirror server
Rights to access some files sometime

But now I' ve gone through what I found on Wiki 
Whithout finding appropriate answer.

Installing basic system software / Binutils-2.14
I got some test results:

My question is 
How is it right or wrong ?
I mean does those results may compromise 
following installation steps


Details below

                === ld Summary ===

# of expected passes            191
# of unexpected failures        1
# of expected failures          1
/binutils-build/ld/ld-new 20030612

make[4]: *** [check-DEJAGNU] Error 1
make[4]: Leaving directory `/binutils-build/ld'
make[3]: *** [check-am] Error 2
make[3]: Leaving directory `/binutils-build/ld'
make[2]: *** [check-recursive] Error 1
make[2]: Leaving directory `/binutils-build/ld'
make[1]: *** [check-ld] Error 2
make[1]: Leaving directory `/binutils-build'
make: *** [check] Error 2

first problem seems to come from previous part here under
make  check-DEJAGNU
make[4]: Entering directory `/binutils-build/ld'
Making a new site.exp file...
srcroot=`cd /sources/binutils-2.14/ld && pwd`; export srcroot; \
r=`pwd`; export r; \
LC_COLLATE=; LC_ALL=; LANG=; export LC_COLLATE LC_ALL LANG; \
EXPECT=expect; export EXPECT; \
if [ -f ./../expect/expect ]; then \
  TCL_LIBRARY=`cd /sources/binutils-2.14/ld/../tcl/library && pwd`; \
  export TCL_LIBRARY; \
fi; \
runtest=runtest; \
if /bin/sh -c "$runtest --version" > /dev/null 2>&1; then \
  $runtest --tool ld --srcdir ${srcroot}/testsuite \
        CC="gcc -L/binutils-build/ld" CFLAGS="-g -O2" \
        CXX="c++ -L/binutils-build/ld" CXXFLAGS="-g -O2" \
        CC_FOR_HOST="gcc" CFLAGS_FOR_HOST="-g -O2" \
        OFILES="ldgram.o ldlex.o lexsup.o ldlang.o mri.o ldctor.o ldmain.o
ldwrite.o ldexp.o  ldemul.o ldver.o ldmisc.o ldfile.o ldcref.o eelf_i386.o
ei386linux.o " BFDLIB="../bfd/.libs/libbfd.a" \
        LIBIBERTY="../libiberty/libiberty.a ./../intl/libintl.a" LIBS="" \
        ; \
else echo "WARNING: could not find \`runtest'" 1>&2; :;\
fi
WARNING: Couldn't find the global config file.
WARNING: Couldn't find tool init file
Test Run By root on Tue Jan 18 20:39:04 2005

second problem seems to come from 

make[3]: Nothing to be done for `check-am'.


third problem may come from here under part of :

make  all-recursive
make[2]: Entering directory `/binutils-build/gprof'
Making all in po
make[3]: Entering directory `/binutils-build/gprof/po'
make[3]: Nothing to be done for `all'.


Thanks a lot

Tristan





More information about the lfs-support mailing list