Glibc check error: tst-eintr2.out

ilja ilja.siera at ukonline.co.uk
Sun Feb 13 05:39:04 PST 2005


Hi,

My glibc-20041011 gives following error upon check:

GCONV_PATH=/source/lfs-6.0/build/glibc-build/iconvdata LC_ALL=C
/source/lfs-6.0/build/glibc-build/elf/ld-linux.so.2 --library-path
/source/lfs-6.0/build/glibc-build:/source/lfs-6.0/build/glibc-build/math:/so
urce/lfs-6.0/build/glibc-build/elf:/source/lfs-6.0/build/glibc-build/dlfcn:/
source/lfs-6.0/build/glibc-build/nss:/source/lfs-6.0/build/glibc-build/nis:/
source/lfs-6.0/build/glibc-build/rt:/source/lfs-6.0/build/glibc-build/resolv
:/source/lfs-6.0/build/glibc-build/crypt:/source/lfs-6.0/build/glibc-build/n
ptl /source/lfs-6.0/build/glibc-build/nptl/tst-eintr2  >
/source/lfs-6.0/build/glibc-build/nptl/tst-eintr2.out
Failed to kill test process: No child processes
make[2]: *** [/source/lfs-6.0/build/glibc-build/nptl/tst-eintr2.out] Error 1
make[2]: Leaving directory `/source/lfs-6.0/build/glibc-20041011/nptl'
make[1]: *** [nptl/tests] Error 2
make[1]: Leaving directory `/source/lfs-6.0/build/glibc-20041011'
make: *** [check] Error 2


Does somebody know why this might be?
I did a bit of googleing but couldn't come up with an answer.
I'm installing from a SuSE-9.1 host and am currently trying to install
LFS-6.1-testing.

Regards,

Ilja





More information about the lfs-support mailing list