Grep 2.5

Anthony Rabaa rabaa at amconresearch.com
Wed Sep 1 07:58:59 PDT 2004


Hello,

I'm attempting to build grep but it is failing on during the 2nd pass check. 
I've appended the output below in hopes that someone may be able to
enlighten me. :-)

Making check in intl
make[1]: Entering directory `/usr/src/grep-2.5/intl'
make[1]: Nothing to be done for `check'.
make[1]: Leaving directory `/usr/src/grep-2.5/intl'
Making check in po
make[1]: Entering directory `/usr/src/grep-2.5/po'
make[1]: Leaving directory `/usr/src/grep-2.5/po'
Making check in lib
make[1]: Entering directory `/usr/src/grep-2.5/lib'
Making check in posix
make[2]: Entering directory `/usr/src/grep-2.5/lib/posix'
make[2]: Nothing to be done for `check'.
make[2]: Leaving directory `/usr/src/grep-2.5/lib/posix'
make[2]: Entering directory `/usr/src/grep-2.5/lib'
make[2]: Nothing to be done for `check-am'.
make[2]: Leaving directory `/usr/src/grep-2.5/lib'
make[1]: Leaving directory `/usr/src/grep-2.5/lib'
Making check in doc
make[1]: Entering directory `/usr/src/grep-2.5/doc'
make[1]: Nothing to be done for `check'.
make[1]: Leaving directory `/usr/src/grep-2.5/doc'
Making check in src
make[1]: Entering directory `/usr/src/grep-2.5/src'
make[1]: Nothing to be done for `check'.
make[1]: Leaving directory `/usr/src/grep-2.5/src'
Making check in tests
make[1]: Entering directory `/usr/src/grep-2.5/tests'
make  check-TESTS
make[2]: Entering directory `/usr/src/grep-2.5/tests'
/bin/sh: ./warning.sh: Permission denied
FAIL: warning.sh
/bin/sh: ./khadafy.sh: Permission denied
FAIL: khadafy.sh
/bin/sh: ./spencer1.sh: Permission denied
FAIL: spencer1.sh
/bin/sh: ./bre.sh: Permission denied
FAIL: bre.sh
/bin/sh: ./ere.sh: Permission denied
FAIL: ere.sh
/bin/sh: ./status.sh: Permission denied
FAIL: status.sh
/bin/sh: ./empty.sh: Permission denied
FAIL: empty.sh
/bin/sh: ./options.sh: Permission denied
FAIL: options.sh
PASS: backref.sh
PASS: file.sh
====================
8 of 10 tests failed
====================
make[2]: *** [check-TESTS] Error 1
make[2]: Leaving directory `/usr/src/grep-2.5/tests'
make[1]: *** [check-am] Error 2
make[1]: Leaving directory `/usr/src/grep-2.5/tests'
make: *** [check-recursive] Error 1
-- 
Anthony Rabaa



More information about the lfs-support mailing list