Tar-1.13.25 Build Error - Chapter 5

John jim.benes at netzero.net
Wed Mar 17 11:55:11 PST 2004


Bringing this up again, since noone has solved it yet...

if gcc -DHAVE_CONFIG_H -I. -I. -I.. -I../intl    -g -O2 -MT getdate.o 
-MD -MP -MF ".deps/getdate.Tpo" -c -o getdate.o getdate.c; \
then mv -f ".deps/getdate.Tpo" ".deps/getdate.Po"; 
else rm -f ".deps/getdate.Tpo"; exit 1; fi
getdate.y: In function `yyparse':
getdate.y:381: error: parse error before '}' token
getdate.y:387: error: parse error before '}' token
getdate.y:393: error: parse error before '}' token
make[2]: *** [getdate.o] Error 1
make[2]: Leaving directory `/mnt/lfs/sources/tar-1.13.25/lib'
make[1]: *** [all-recursive] Error 1
make[1]: Leaving directory `/mnt/lfs/sources/tar-1.13.25'
make: *** [all] Error 2

------
LFS CVS 3-4-04
RH9






More information about the lfs-support mailing list