binutils-2.14 - pass 1 LFS-5.0 build error

Roman Kaganovich nospam at nospam.com
Fri Mar 12 20:37:26 PST 2004


When running command:

  make LDFLAGS="-all-static"

------------------------------------------------------------------------------------------------------------------------
make[3]: Entering directory `/lfs/sources/binutils-build/binutils'
/bin/sh ./libtool --mode=link gcc -W -Wall -Wstrict-prototypes 
-Wmissing-prototypes -g -O2 -all -static -o size  size.o bucomm.o 
version.o filemode.o ../bfd/libbfd.la ../libiberty/libiberty.a
gcc -W -Wall -Wstrict-prototypes -Wmissing-prototypes -g -O2 -all -o 
size size.o bucomm.o version.o filemode.o  ../bfd/.libs/libbfd.a 
../libiberty/libiberty.a
/usr/bin/ld: Dwarf Error: Invalid or unhandled FORM value: 14.
/usr/bin/ld: Dwarf Error: Invalid or unhandled FORM value: 14.
/usr/bin/ld: Dwarf Error: Invalid or unhandled FORM value: 14.
/usr/bin/ld: Dwarf Error: Could not find abbrev number 1825.
bucomm.o: In function `make_tempname':
bucomm.o(.text+0x9e6): the use of `mktemp' is dangerous, better use 
`mkstemp'
collect2: ld returned 1 exit status
make[3]: *** [size] Error 1
make[3]: Leaving directory `/lfs/sources/binutils-build/binutils'
make[2]: *** [all-recursive] Error 1
make[2]: Leaving directory `/lfs/sources/binutils-build/binutils'
make[1]: *** [all-recursive-am] Error 2
make[1]: Leaving directory `/lfs/sources/binutils-build/binutils'
make: *** [all-binutils] Error 2

---------------------------------------------------------------------------------------------------------------------

My system info

RH-7.2
gcc (GCC) 3.3.1
Linux localhost 2.4.7-10 #1 Thu Sep 6 17:27:27 EDT 2001 i686 unknown



More information about the lfs-support mailing list