BLFS-5.0: Gstreamer-0.6.4 installation error.

randhir phagura rsphagura at
Mon Mar 1 20:03:59 PST 2004


I have installed Nautilus. 'gstreamer' package is required by 
'Nautilus-media'. While trying to install 'gstraeamer', I got the follwing 

ranlib .libs/libgstspider.a
(cd .libs && rm -f && ln -s ../
-D_FILE_OFFSET_BITS=64 -I/usr/include/libxml2   -pthread 
-I/usr/lib/glib-2.0/include   -I../..  -Wall -DGST_DISABLE_DEPRECATED -g
-I../../libs -I../../include -g -O2 -MT spidertest-spidertest.o -MD -MP -MF
".deps/spidertest-spidertest.Tpo" -c -o spidertest-spidertest.o `test -f
'spidertest.c' || echo './'`spidertest.c; \
then mv -f ".deps/spidertest-spidertest.Tpo" 
else rm -f ".deps/spidertest-spidertest.Tpo"; exit 1; fi
/bin/sh ../../libtool --mode=link gcc  -g -O2   -o spidertest
spidertest-spidertest.o -lxml2 -lpthread -lz -lm   -pthread 
-lgobject-2.0 -lgthread-2.0 -lgmodule-2.0 -ldl -lglib-2.0   -lpopt
gcc -g -O2 -o .libs/spidertest spidertest-spidertest.o -Wl,--export-dynamic
-pthread ../../gst/.libs/ /usr/lib/ -lz -lm
/usr/lib/ /usr/lib/ -lpthread
/usr/lib/ -ldl /usr/lib/ /usr/lib/
../../gst/.libs/ undefined reference to 
collect2: ld returned 1 exit status
make[4]: *** [spidertest] Error 1
make[4]: Leaving directory `/home/p/gstreamer-0.7.5/gst/autoplug'
make[3]: *** [all-recursive] Error 1
make[3]: Leaving directory `/home/p/gstreamer-0.7.5/gst'
make[2]: *** [all] Error 2
make[2]: Leaving directory `/home/p/gstreamer-0.7.5/gst'
make[1]: *** [all-recursive] Error 1
make[1]: Leaving directory `/home/p/gstreamer-0.7.5'
make: *** [all] Error 2

Although, the output shows 'gstreamer' version as '0.7.5', I obtained the 
same output with
version '0.6.4' also. I thought there may be a bug in the earlier version 
and, hence, tried with the latest. But as it shows, this has not helped.

I am keenly looking for help from advanced members, please.


The world of entertainment. With all its spice & gossip! Specially for you!

More information about the lfs-support mailing list