Binutils DEJAGNU-Error (Base System Chapter 6)

Martin Schöler lfs at digle.de
Fri Jun 25 09:03:55 PDT 2004


Hello!

I have got the same Problem like Andrew Sharp had in his mail
in May the 1th titled "binutils-2.14 ch6 check DEJAGNU error".
I used the LFS-version "CVS-20040621" and really created this
Linux "from scratch". The versions are the same as recommended
in the book. I even created this LVS now for the second time and
had the same error. I googled around with no success and the
faqs didn't help me either, nor the wiki.

Every time, I compile the Binutils in chapter 6, I get some errors.

I did
$ ../binutils-2.15.91.0.1/configure --prefix=/usr --enable-shared
	-> without errors
$ make tooldir=/usr
	-> also without errors
$ make -k check
	-> with the following errors

Could anybody please help me?
Thanx!
Martin Schöler

-------------------------------------------------------------------------
                    .
                    .
                    .
Running /build/binutils-2.15.91.0.1/ld/testsuite/ld-xtensa/coalesce.exp ...
Running /build/binutils-2.15.91.0.1/ld/testsuite/ld-xtensa/lcall.exp ...

                 === ld Summary ===

# of expected passes            204
# of unexpected failures        7
# of expected failures          2
/build/binutils-2.15.91.0.1-build/ld/ld-new 20040527

make[3]: *** [check-DEJAGNU] Error 1
make[3]: Leaving directory `/build/binutils-2.15.91.0.1-build/ld'
make[2]: *** [check-am] Error 2
make[2]: Leaving directory `/build/binutils-2.15.91.0.1-build/ld'
make[1]: *** [check-recursive] Error 1
make[1]: Target `check' not remade because of errors.
make[1]: Leaving directory `/build/binutils-2.15.91.0.1-build/ld'
make: *** [check-ld] Error 2
make[1]: Entering directory `/build/binutils-2.15.91.0.1-build/libiberty'
make[2]: Entering directory 
`/build/binutils-2.15.91.0.1-build/libiberty/testsuite'
gcc -DHAVE_CONFIG_H -g -O2  -I.. 
-I../../../binutils-2.15.91.0.1/libiberty/testsuite/
../../include  -o test-demangle \
 
../../../binutils-2.15.91.0.1/libiberty/testsuite/test-demangle.c 
../libibert
y.a -ldl
./test-demangle < 
../../../binutils-2.15.91.0.1/libiberty/testsuite/demangle-expected
./test-demangle: 745 tests, 0 failures
make[2]: Leaving directory 
`/build/binutils-2.15.91.0.1-build/libiberty/testsuite'
make[1]: Leaving directory `/build/binutils-2.15.91.0.1-build/libiberty'
make: Target `check' not remade because of errors.
-------------------------------------------------------------------------



More information about the lfs-support mailing list