lfs 5.0 gcc pass1 compile error

silashields at ttnet.net.tr silashields at ttnet.net.tr
Thu Jun 17 23:50:25 PDT 2004


Hi all, 
 
I am compiling a new lfs at my new work (dream job a complete 
linux erp network) and I am getting the following error while 
compiling gcc pass1. Note there is most probably something 
missing on the host system as it is an lfs cd I made and copied 
to the computer (hp dx875a) but I can't figure out exactly what. I 
think it is something to do with the kernel headers in include. 
 
./xgcc -B./ -B/tools/i686-pc-linux-gnu/bin/ -isystem 
/tools/i686-pc-linux-gnu/include -isystem 
/tools/i686-pc-linux-gnu/sys-include -O2  -DIN_GCC    -W -Wall 
-Wwrite-strings -Wstrict-prototypes -Wmissing-prototypes -isystem 
./include  -fPIC -g -DHAVE_GTHR_DEFAULT -DIN_LIBGCC2 
-D__GCC_FLOAT_NOT_NEEDED  -I. -I. 
-I/usr/src/leLinux/BUILD/gcc-3.3.1/gcc 
-I/usr/src/leLinux/BUILD/gcc-3.3.1/gcc/. 
-I/usr/src/leLinux/BUILD/gcc-3.3.1/gcc/config 
-I/usr/src/leLinux/BUILD/gcc-3.3.1/gcc/../include  -DL_negdi2 -c 
/usr/src/leLinux/BUILD/gcc-3.3.1/gcc/libgcc2.c -o 
libgcc/./_negdi2.o 
In file included from /usr/include/signal.h:358, 
                 from 
/usr/src/leLinux/BUILD/gcc-3.3.1/gcc/config/i386/linux.h:232, 
                 from tconfig.h:23, 
                 from 
/usr/src/leLinux/BUILD/gcc-3.3.1/gcc/libgcc2.c:36: 
/usr/include/bits/sigthread.h:36: error: storage class specified for 
parameter `type name' 
In file included from /usr/include/signal.h:358, 
                 from 
/usr/src/leLinux/BUILD/gcc-3.3.1/gcc/config/i386/linux.h:232, 
                 from tconfig.h:23, 
                 from 
/usr/src/leLinux/BUILD/gcc-3.3.1/gcc/libgcc2.c:36: 
/usr/include/bits/sigthread.h:36: error: storage class specified for 
parameter `type name' 
make[3]: *** [libgcc/./_muldi3.o] Error 1 
make[3]: *** Waiting for unfinished jobs.... 
make[3]: *** [libgcc/./_negdi2.o] Error 1 
make[3]: Leaving directory `/usr/src/leLinux/BUILD/gcc-build/gcc' 
make[2]: *** [libgcc.a] Error 2 
make[2]: Leaving directory `/usr/src/leLinux/BUILD/gcc-build/gcc' 
make[1]: *** [stage1_build] Error 2 
make[1]: Leaving directory `/usr/src/leLinux/BUILD/gcc-build/gcc' 
make: *** [bootstrap] Error 2 
 
-- 
Shane Shields 
 
Registered LFS Compiler: 7582 
To drink the WINE of success you must first seek the sayings of 
source 
 
Anyone sending unwanted advertising e-mail to this address will 
be 
charged $25 for network traffic and computing time. By 
extracting my 
address from this message or its header, you agree to these 
terms. 




More information about the lfs-support mailing list