glibc-2.3.3-lfs-5.1 make check errors in Chapter 6

Bryan K. Walton zxcvbnm at decentralized.org
Tue Jun 8 07:50:31 PDT 2004


Hi Chris,
	Thanks for your reply.  I continued on and issued a "make -k check".
Now I get the following (the warning about clock skew is due to me changing
the system time inbetween running make and make check):

test-ifaddrs.c: In function `main':
test-ifaddrs.c:52: warning: inlining failed in call to `addr_string'
test-ifaddrs.c:83: warning: called from here
test-ifaddrs.c:52: warning: inlining failed in call to `addr_string'
test-ifaddrs.c:83: warning: called from here
test-ifaddrs.c:52: warning: inlining failed in call to `addr_string'
test-ifaddrs.c:83: warning: called from here
make[2]: *** [/pub/glibc-build/inet/test-ifaddrs.out] Error 1
make[2]: Target `tests' not remade because of errors.
make[2]: warning:  Clock skew detected.  Your build may be incomplete.
make[1]: *** [inet/tests] Error 2
make[2]: Warning: File `/dev/null' has modification time 3.1e+03 s in the future
make[2]: warning:  Clock skew detected.  Your build may be incomplete.
make[2]: Warning: File `/dev/null' has modification time 3.1e+03 s in the future
tst-dlmodcount.c: In function `callback':
tst-dlmodcount.c:40: warning: implicit declaration of function `exit'
tst-dlmodcount.c: In function `unload':
tst-dlmodcount.c:88: warning: unused variable `ret'
make[2]: warning:  Clock skew detected.  Your build may be incomplete.
make[1]: Target `check' not remade because of errors.
make: *** [check] Error 2

Should I forget about it and go ahead and do the make install?

Thanks!
Bryan



More information about the lfs-support mailing list