Compile error in 2nd run gcc-3.3.3

Dennis Clausen D.Clausen at web.de
Tue Jul 27 12:09:38 PDT 2004


Hi!

I've got a problem while compiling gcc for the second time (in chapter 5):
'configure' runs perfekt without any problems but when I 'make', I get this
error (hope, this is enough information):

../../../../gcc-3.3.3/libstdc++-v3/src/locale-inst.cc:225:   instantiated
from here
/mnt/lfs/sources/gcc-build/i686-pc-linux-gnu/libstdc++-v3/include/i686-pc-li
nux-gnu/bits/messages_members.h:50: warning: unused
   parameter `const char*__s'
xgcc: Internal error: Killed (program cc1plus)
Please submit a full bug report.
See <URL:http://gcc.gnu.org/bugs.html> for instructions.
make[3]: *** [locale-inst.lo] Error 1
make[3]: Leaving directory
`/mnt/lfs/sources/gcc-build/i686-pc-linux-gnu/libstdc++-v3/src'
make[2]: *** [all-recursive] Error 1
make[2]: Leaving directory
`/mnt/lfs/sources/gcc-build/i686-pc-linux-gnu/libstdc++-v3'
make[1]: *** [all-recursive-am] Error 2
make[1]: Leaving directory
`/mnt/lfs/sources/gcc-build/i686-pc-linux-gnu/libstdc++-v3'
make: *** [all-target-libstdc++-v3] Error 2

Can anybody help me?

Greetings,
Dennis





More information about the lfs-support mailing list