Binutils pass 2

John Paul John.Paul at wanadoo.fr
Mon Jan 26 12:49:56 PST 2004


Well, I've tried your suggestions. I moved the build and  source folders 
to old, and I try to build binutils for  clean sources.
Nothing changed except the output message, see below.

what should I do now ?

John

Test Run By lfs on Mon Jan 26 20:14:03 2004
Native configuration is i686-pc-linux-gnu

                === binutils tests ===

Schedule of variations:
    unix

Running target unix
Using /tools/share/dejagnu/baseboards/unix.exp as board description file for target.
Using /tools/share/dejagnu/config/unix.exp as generic interface file for target.
Using /media/lfs/sources/binutils-2.14/binutils/testsuite/config/default.exp as tool-and-target-specific interface file.
Running /media/lfs/sources/binutils-2.14/binutils/testsuite/binutils-all/ar.exp ...
FAIL: ar long file names
ERROR: /media/lfs/sources/binutils-2.14/binutils/testsuite/binutils-all/bintest.s: assembly failed
Running /media/lfs/sources/binutils-2.14/binutils/testsuite/binutils-all/dlltool.exp ...
Running /media/lfs/sources/binutils-2.14/binutils/testsuite/binutils-all/hppa/objdump.exp ...
Running /media/lfs/sources/binutils-2.14/binutils/testsuite/binutils-all/nm.exp ...
Version /media/lfs/sources/binutils-build/binutils/nm-new reference
ERROR: /media/lfs/sources/binutils-2.14/binutils/testsuite/binutils-all/bintest.s: assembly failed
Running /media/lfs/sources/binutils-2.14/binutils/testsuite/binutils-all/objcopy.exp ...
Version /media/lfs/sources/binutils-build/binutils/objcopy reference
ERROR: /media/lfs/sources/binutils-2.14/binutils/testsuite/binutils-all/bintest.s: assembly failed
ERROR: unresolved 1
Running /media/lfs/sources/binutils-2.14/binutils/testsuite/binutils-all/objdump.exp ...
Version /media/lfs/sources/binutils-build/binutils/objdump reference
FAIL: objdump -i
ERROR: /media/lfs/sources/binutils-2.14/binutils/testsuite/binutils-all/bintest.s: assembly failed
Running /media/lfs/sources/binutils-2.14/binutils/testsuite/binutils-all/readelf.exp ...
Version /media/lfs/sources/binutils-build/binutils/readelf 20030612
ERROR: /media/lfs/sources/binutils-2.14/binutils/testsuite/binutils-all/bintest.s: assembly failed
ERROR: unresolved 1
Running /media/lfs/sources/binutils-2.14/binutils/testsuite/binutils-all/size.exp ...
Version /media/lfs/sources/binutils-build/binutils/size reference
ERROR: /media/lfs/sources/binutils-2.14/binutils/testsuite/binutils-all/bintest.s: assembly failed
Running /media/lfs/sources/binutils-2.14/binutils/testsuite/binutils-all/windres/windres.exp ...

                === binutils Summary ===

# of unexpected failures        2
# of unresolved testcases       3
make[4]: *** [check-DEJAGNU] Error 1
make[4]: Leaving directory `/media/lfs/sources/binutils-build/binutils'
make[3]: *** [check-am] Error 2
make[3]: Leaving directory `/media/lfs/sources/binutils-build/binutils'
make[2]: *** [check-recursive] Error 1
make[2]: Leaving directory `/media/lfs/sources/binutils-build/binutils'
make[1]: *** [check-binutils] Error 2
make[1]: Leaving directory `/media/lfs/sources/binutils-build'
make: *** [check] Error 2





Ken Moffat wrote:

>On Sun, 25 Jan 2004, John Paul wrote:
>
>  
>
>>Hello everybody,
>>I've this message during the "make check" for binutils pass 2. I've look
>>on the web, for an help but I didn't find any answer to my question.
>>What could be wrong ?
>>    
>>
>
> It is covered in search.linuxfromscratch.org, but it's a bit hard to
>find.
>
>  
>
>>I'm using a Suse 8.2 wih gcc 3.3.2   (also build for my LFS).
>>
>>/bin/sh ./libtool --mode=link gcc -W -Wall -Wstrict-prototypes -Wmissing-prototypes -g -O2  -o libbfd.la -rpath /tools/lib -release 2.14  archive.lo archures.lo bfd.lo bfdio.lo bfdwin.lo cache.lo coffgen.lo corefile.lo format.lo init.lo libbfd.lo opncls.lo reloc.lo section.lo syms.lo targets.lo hash.lo linker.lo srec.lo binary.lo tekhex.lo ihex.lo stabs.lo stab-syms.lo merge.lo dwarf2.lo simple.lo archive64.lo `cat ofiles` -L../libiberty/pic -liberty
>>./libtool: line 1: cd: ../libiberty/pic: No such file or directory
>>libtool: link: cannot determine absolute directory name of `../libiberty/pic'
>>make[3]: *** [libbfd.la] Error 1
>>make[3]: Leaving directory `/media/lfs/sources/binutils-build/bfd'
>>make[2]: *** [all-recursive] Error 1
>>make[2]: Leaving directory `/media/lfs/sources/binutils-build/bfd'
>>make[1]: *** [all-recursive-am] Error 2
>>make[1]: Leaving directory `/media/lfs/sources/binutils-build/bfd'
>>make: *** [all-bfd] Error 2
>>
>>Thanks for your help.
>>John
>>
>>    
>>
>
> The suggestion is that you didn't delete the directories (source and
>build) from pass 1.  You should have removed these during "locking in
>glibc".
>
>Ken
>  
>

-------------- next part --------------
An HTML attachment was scrubbed...
URL: <http://lists.linuxfromscratch.org/pipermail/lfs-support/attachments/20040126/abb620a0/attachment.html>


More information about the lfs-support mailing list