error in "make check" for first pass of glibc

Robert P. J. Day rpjday at mindspring.com
Sun Jan 4 12:04:52 PST 2004


  while i'm aware that i might get errors in the "make check" from glibc,
i didn't see this one listed in the docs and it looks kind of serious.

...
make  -C stdlib tests
make[2]: Entering directory `/lfs/sources/glibc-2.3.2/stdlib'
cd /lfs/build/glibc/stdlib && gcc -B/lfs/build/glibc/ -O  -include ../config.h /lfs/sources/glibc-2.3.2/stdlib/isomac.c -o isomac
/tmp/ccemhB4V.o(.text+0x157): In function `get_null_defines':
: the use of `tmpnam' is dangerous, better use `mkstemp'
/usr/lib/crt1.o(.text+0xc): In function `_start':
: undefined reference to `__libc_csu_fini'
/usr/lib/crt1.o(.text+0x11): In function `_start':
: undefined reference to `__libc_csu_init'
/lfs/build/glibc/libc.so: undefined reference to `__libc_stack_end at GLIBC_PRIVATE'
collect2: ld returned 1 exit status
make[2]: *** [/lfs/build/glibc/stdlib/isomac] Error 1
make[2]: Leaving directory `/lfs/sources/glibc-2.3.2/stdlib'
make[1]: *** [stdlib/tests] Error 2
make[1]: Leaving directory `/lfs/sources/glibc-2.3.2'
make: *** [check] Error 2

  thoughts?

rday





More information about the lfs-support mailing list