error building binutils pass 2

Timothy Washington timothyjwashington at yahoo.ca
Wed Feb 25 21:50:12 PST 2004


In LFS, book 5, chapter5, I keep running into an error
in binutils, pass 2
(http://www.ca.linuxfromscratch.org/lfs/view/stable/chapter05/binutils-pass2.html).
This occurs in the first make:

...
gcc -W -Wall -Wstrict-prototypes -Wmissing-prototypes
-g -O2 -o .libs/ar arparse.o arlex.o ar.o not-ranlib.o
arsup.o rename.o binemul.o emul_vanilla.o bucomm.o
version.o filemode.o  ../bfd/.libs/libbfd.so
-L/mnt/lfs/sources/binutils-build/libiberty/pic
-liberty ../libiberty/libiberty.a -lfl -Wl,--rpath
-Wl,/tools/lib
/tools/lib/gcc-lib/i686-pc-linux-gnu/3.3.1/../../../../i686-pc-linux-gnu/bin/ld:
cannot find -lfl
collect2: ld returned 1 exit status
make[3]: *** [ar] Error 1
make[3]: Leaving directory
`/mnt/lfs/sources/binutils-build/binutils'
make[2]: *** [all-recursive] Error 1
make[2]: Leaving directory
`/mnt/lfs/sources/binutils-build/binutils'
make[1]: *** [all-recursive-am] Error 2
make[1]: Leaving directory
`/mnt/lfs/sources/binutils-build/binutils'
make: *** [all-binutils] Error 2


=====
Timothy Washington
timothyjwashington at yahoo.ca

______________________________________________________________________ 
Post your free ad now! http://personals.yahoo.ca



More information about the lfs-support mailing list