gcc compiling problem

Pablo Wolter pawn at myrealbox.com
Wed Dec 22 10:44:01 PST 2004


Pablo Wolter wrote:

> Matthew Burgess wrote:
>
>> Pablo Wolter wrote:
>>
>>> Hi,
>>>
>>> I know that this issue was already discussed here, but in my searchs 
>>> for a solution with the error in the compilation process of gcc at 
>>> the very beginning of the book i found some solutions that involve 
>>> an upgrade of binutils in the "host"machine, my problem is that my 
>>> actual version of LD is the most new one because I'm usind debian 
>>> sid with kernel 2.6.8. There's a solution in odifying some source 
>>> files in the gcc-3.3.3 package that come's with release 5.1.1?
>>>
>>> Thanks in advance if somebody can point me some tips, I'm really 
>>> stopped at the very beginning of all this.
>>>
>>> Pablo.
>>>
>>
>> It would help immensely if you could copy and paste the exact error 
>> you get when you try to compile gcc.
>>
>> Regards,
>>
>> Matt.
>
>
>
> Sorry for the delay. I read a litle but cannot solve the problem, it 
> seems that the LD version that i'm using is not compatible. I have to 
> do: export CC=/usr/bin/gcc-3.0 because 3.3 and 2.95 doesn't run the 
> configure part. This is the error when trying to compile gcc.
>
> make[3]: Entering directory `/ora8/sources/gcc-build/gcc'
> for d in libgcc; do \
>  if [ -d $d ]; then true; else /bin/sh 
> ..../../gcc-3.3.3/gcc/mkinstalldirs $d; fi; \
> done
> if [ -f stmp-dirs ]; then true; else touch stmp-dirs; fi
> .../xgcc -B./ -B/tools/i686-pc-linux-gnu/bin/ -isystem 
> /tools/i686-pc-linux-gnu/include -isystem 
> /tools/i686-pc-linux-gnu/sys-include -O2  -DIN_GCC    -W -Wall 
> -Wwrite-strings -Wstrict-prototypes -Wmissing-prototypes -isystem 
> .../include  -fPIC -g -DHAVE_GTHR_DEFAULT -DIN_LIBGCC2 
> -D__GCC_FLOAT_NOT_NEEDED  -shared -nodefaultlibs 
> -Wl,--soname=libgcc_s.so.1 -Wl,--version-script=libgcc/./libgcc.map -o 
> libgcc_s.so.1   libgcc/./_muldi3.o libgcc/./_negdi2.o 
> libgcc/./_lshrdi3.o libgcc/./_ashldi3.o libgcc/./_ashrdi3.o 
> libgcc/./_ffsdi2.o libgcc/./_clz.o libgcc/./_cmpdi2.o 
> libgcc/./_ucmpdi2.o libgcc/./_floatdidf.o libgcc/./_floatdisf.o 
> libgcc/./_fixunsdfsi.o libgcc/./_fixunssfsi.o libgcc/./_fixunsdfdi.o 
> libgcc/./_fixdfdi.o libgcc/./_fixunssfdi.o libgcc/./_fixsfdi.o 
> libgcc/./_fixxfdi.o libgcc/./_fixunsxfdi.o libgcc/./_floatdixf.o 
> libgcc/./_fixunsxfsi.o libgcc/./_fixtfdi.o libgcc/./_fixunstfdi.o 
> libgcc/./_floatditf.o libgcc/./_clear_cache.o libgcc/./_trampoline.o 
> libgcc/./__main.o libgcc/./_exit.o libgcc/./_absvsi2.o 
> libgcc/./_absvdi2.o libgcc/./_addvsi3.o libgcc/./_addvdi3.o 
> libgcc/./_subvsi3.o libgcc/./_subvdi3.o libgcc/./_mulvsi3.o 
> libgcc/./_mulvdi3.o libgcc/./_negvsi2.o libgcc/./_negvdi2.o 
> libgcc/./_ctors.o libgcc/./_divdi3.o libgcc/./_moddi3.o 
> libgcc/./_udivdi3.o libgcc/./_umoddi3.o libgcc/./_udiv_w_sdiv.o 
> libgcc/./_udivmoddi4.o  libgcc/./unwind-dw2.o 
> libgcc/./unwind-dw2-fde-glibc.o libgcc/./unwind-sjlj.o 
> libgcc/./unwind-c.o -lc && rm -f libgcc_s.so && ln -s libgcc_s.so.1 
> libgcc_s.so
> /tools/i686-pc-linux-gnu/bin/ld: cannot find -lc
> collect2: ld returned 1 exit status
> make[3]: *** [libgcc_s.so] Error 1
> make[3]: Leaving directory `/ora8/sources/gcc-build/gcc'
> make[2]: *** [libgcc.a] Error 2
> make[2]: Leaving directory `/ora8/sources/gcc-build/gcc'
> make[1]: *** [stage1_build] Error 2
> make[1]: Leaving directory `/ora8/sources/gcc-build/gcc'
> make: *** [bootstrap] Error 2
>
> Thanks for any tip that can give me guys because I really don't know 
> why is not compiling it with ld if this version comes from the 
> binutils package used in LFS 5.1.1
>
Now, I re compile binutils from the beginning and it goes fine. I try to 
compile gcc, the configure goes fine but when I try to make:

make BOOT_LDFLAGS="-static" bootstrap

libbackend.a(reload.o)(.text+0x1048f):/ora8/sources/gcc-build/gcc/../../gcc-3.3.3/gcc/reload.c:5725: 
undefined reference to `subreg_regno'
libbackend.a(reload.o)(.text+0x110ae): In function `find_replacement':
/ora8/sources/gcc-build/gcc/../../gcc-3.3.3/gcc/reload.c:6133: undefined 
reference to `subreg_regno_offset'
libbackend.a(reload.o)(.text+0x11413): In function 
`refers_to_regno_for_reload_p':
/ora8/sources/gcc-build/gcc/../../gcc-3.3.3/gcc/reload.c:6228: undefined 
reference to `subreg_regno'
libbackend.a(reload.o)(.text+0x11856): In function 
`reg_overlap_mentioned_for_reload_p':
/ora8/sources/gcc-build/gcc/../../gcc-3.3.3/gcc/reload.c:6324: undefined 
reference to `subreg_regno_offset'
libbackend.a(reload.o)(.text+0x1192e):/ora8/sources/gcc-build/gcc/../../gcc-3.3.3/gcc/reload.c:6349: 
undefined reference to 
`reg_mentioned_p'libbackend.a(reload.o)(.text+0x11e69): In function 
`find_equiv_reg':
/ora8/sources/gcc-build/gcc/../../gcc-3.3.3/gcc/reload.c:6502: undefined 
reference to `single_set_2'
libbackend.a(reload.o)(.text+0x12005):/ora8/sources/gcc-build/gcc/../../gcc-3.3.3/gcc/reload.c:6505: 
undefined reference to `find_reg_note'
libbackend.a(reload.o)(.text+0x12111):/ora8/sources/gcc-build/gcc/../../gcc-3.3.3/gcc/reload.c:6505: 
undefined reference to `find_reg_note'
libbackend.a(reload.o)(.text+0x1233d):/ora8/sources/gcc-build/gcc/../../gcc-3.3.3/gcc/reload.c:6593: 
undefined reference to `find_reg_note'
libbackend.a(reload.o)(.text+0x123dd):/ora8/sources/gcc-build/gcc/../../gcc-3.3.3/gcc/reload.c:6610: 
undefined reference to `single_set_2'
libbackend.a(reload.o)(.text+0x12bb7):/ora8/sources/gcc-build/gcc/../../gcc-3.3.3/gcc/reload.c:6703: 
undefined reference to 
`volatile_insn_p'libbackend.a(reload1.o)(.text+0xc39): In function `reload':
/ora8/sources/gcc-build/gcc/../../gcc-3.3.3/gcc/reload1.c:754: undefined 
reference to `single_set_2'
libbackend.a(reload1.o)(.text+0xc94):/ora8/sources/gcc-build/gcc/../../gcc-3.3.3/gcc/reload1.c:763: 
undefined reference to `find_reg_note'
libbackend.a(reload1.o)(.text+0xcf5):/ora8/sources/gcc-build/gcc/../../gcc-3.3.3/gcc/reload1.c:771: 
undefined reference to `find_reg_note'
libbackend.a(reload1.o)(.text+0x111d):/ora8/sources/gcc-build/gcc/../../gcc-3.3.3/gcc/reload1.c:885: 
undefined reference to `note_stores'
libbackend.a(reload1.o)(.text+0x181e):/ora8/sources/gcc-build/gcc/../../gcc-3.3.3/gcc/reload1.c:1084: 
undefined reference to `reg_set_p'
libbackend.a(reload1.o)(.text+0x1c2e):/ora8/sources/gcc-build/gcc/../../gcc-3.3.3/gcc/reload1.c:1199: 
undefined reference to `find_reg_note'
libbackend.a(reload1.o)(.text+0x23f5): In function `maybe_fix_stack_asms':
/ora8/sources/gcc-build/gcc/../../gcc-3.3.3/gcc/reload1.c:1401: 
undefined reference to `target_flags'
libbackend.a(reload1.o)(.text+0x2401):/ora8/sources/gcc-build/gcc/../../gcc-3.3.3/gcc/reload1.c:1401: 
undefined reference to `target_flags'
libbackend.a(reload1.o)(.text+0x2449):/ora8/sources/gcc-build/gcc/../../gcc-3.3.3/gcc/reload1.c:1401: 
undefined reference to `target_flags'
libbackend.a(reload1.o)(.text+0x2455):/ora8/sources/gcc-build/gcc/../../gcc-3.3.3/gcc/reload1.c:1401: 
undefined reference to `target_flags'
libbackend.a(reload1.o)(.text+0x249d):/ora8/sources/gcc-build/gcc/../../gcc-3.3.3/gcc/reload1.c:1401: 
undefined reference to `target_flags'
libbackend.a(reload1.o)(.text+0x24a9):/ora8/sources/gcc-build/gcc/../../gcc-3.3.3/gcc/reload1.c:1401: 
more undefined references to `target_flags' follow
libbackend.a(reload1.o)(.text+0x2c95): In function 
`calculate_needs_all_insns':
/ora8/sources/gcc-build/gcc/../../gcc-3.3.3/gcc/reload1.c:1475: 
undefined reference to `single_set_2'
libbackend.a(reload1.o)(.text+0x2d95):/ora8/sources/gcc-build/gcc/../../gcc-3.3.3/gcc/reload1.c:1500: 
undefined reference to `single_set_2'
libbackend.a(reload1.o)(.text+0x47e7): In function `delete_dead_insn':
/ora8/sources/gcc-build/gcc/../../gcc-3.3.3/gcc/reload1.c:1939: 
undefined reference to `reg_mentioned_p'
libbackend.a(reload1.o)(.text+0x4801):/ora8/sources/gcc-build/gcc/../../gcc-3.3.3/gcc/reload1.c:1939: 
undefined reference to `find_regno_note'
libbackend.a(reload1.o)(.text+0x4819):/ora8/sources/gcc-build/gcc/../../gcc-3.3.3/gcc/reload1.c:1939: 
undefined reference to 
`side_effects_p'libbackend.a(reload1.o)(.text+0x6675): In function 
`eliminate_regs_in_insn':
/ora8/sources/gcc-build/gcc/../../gcc-3.3.3/gcc/reload1.c:2936: 
undefined reference to `single_set_2'
libbackend.a(reload1.o)(.text+0x6883):/ora8/sources/gcc-build/gcc/../../gcc-3.3.3/gcc/reload1.c:2985: 
undefined reference to `single_set_2'
libbackend.a(reload1.o)(.text+0x69a9):/ora8/sources/gcc-build/gcc/../../gcc-3.3.3/gcc/reload1.c:3009: 
undefined reference to `single_set_2'
libbackend.a(reload1.o)(.text+0x6cad):/ora8/sources/gcc-build/gcc/../../gcc-3.3.3/gcc/reload1.c:3096: 
undefined reference to `single_set_2'
libbackend.a(reload1.o)(.text+0x8a62): In function `reload_as_needed':
/ora8/sources/gcc-build/gcc/../../gcc-3.3.3/gcc/reload1.c:3960: 
undefined reference to `note_stores'
libbackend.a(reload1.o)(.text+0x8aa6):/ora8/sources/gcc-build/gcc/../../gcc-3.3.3/gcc/reload1.c:3966: 
undefined reference to `note_stores'
libbackend.a(reload1.o)(.text+0xb05e): In function 
`conflicts_with_override':
/ora8/sources/gcc-build/gcc/../../gcc-3.3.3/gcc/reload1.c:5045: 
undefined reference to `reg_overlap_mentioned_p'
libbackend.a(reload1.o)(.text+0xc25a): In function `choose_reload_regs':
/ora8/sources/gcc-build/gcc/../../gcc-3.3.3/gcc/reload1.c:5460: 
undefined reference to `subreg_regno'
libbackend.a(reload1.o)(.text+0xc319):/ora8/sources/gcc-build/gcc/../../gcc-3.3.3/gcc/reload1.c:5491: 
undefined reference to `subreg_regno_offset'
libbackend.a(reload1.o)(.text+0xd00d):/ora8/sources/gcc-build/gcc/../../gcc-3.3.3/gcc/reload1.c:5648: 
undefined reference to `single_set_2'
libbackend.a(reload1.o)(.text+0xd1b2):/ora8/sources/gcc-build/gcc/../../gcc-3.3.3/gcc/reload1.c:5673: 
undefined reference to `subreg_regno'
libbackend.a(reload1.o)(.text+0xe780): In function `merge_assigned_reloads':
/ora8/sources/gcc-build/gcc/../../gcc-3.3.3/gcc/reload1.c:6045: 
undefined reference to `reg_set_p'
libbackend.a(reload1.o)(.text+0xe80d):/ora8/sources/gcc-build/gcc/../../gcc-3.3.3/gcc/reload1.c:6058: 
undefined reference to `reg_overlap_mentioned_p'
libbackend.a(reload1.o)(.text+0xf0b2): In function 
`emit_input_reload_insns':
/ora8/sources/gcc-build/gcc/../../gcc-3.3.3/gcc/reload1.c:6307: 
undefined reference to `dead_or_set_p'
libbackend.a(reload1.o)(.text+0xf2fe):/ora8/sources/gcc-build/gcc/../../gcc-3.3.3/gcc/reload1.c:6380: 
undefined reference to `dead_or_set_p'
libbackend.a(reload1.o)(.text+0xf3ad):/ora8/sources/gcc-build/gcc/../../gcc-3.3.3/gcc/reload1.c:6402: 
undefined reference to `dead_or_set_p'
libbackend.a(reload1.o)(.text+0xf495):/ora8/sources/gcc-build/gcc/../../gcc-3.3.3/gcc/reload1.c:6414: 
undefined reference to `count_occurrences'
libbackend.a(reload1.o)(.text+0xfae5): In function 
`emit_output_reload_insns':
/ora8/sources/gcc-build/gcc/../../gcc-3.3.3/gcc/reload1.c:6784: 
undefined reference to `single_set_2'
libbackend.a(reload1.o)(.text+0xfb2a):/ora8/sources/gcc-build/gcc/../../gcc-3.3.3/gcc/reload1.c:6784: 
undefined reference to `reg_mentioned_p'
libbackend.a(reload1.o)(.text+0xfbaa):/ora8/sources/gcc-build/gcc/../../gcc-3.3.3/gcc/reload1.c:6804: 
undefined reference to `note_stores'
libbackend.a(reload1.o)(.text+0xfbbe):/ora8/sources/gcc-build/gcc/../../gcc-3.3.3/gcc/reload1.c:6806: 
undefined reference to `reg_mentioned_p'
libbackend.a(reload1.o)(.text+0xfc01):/ora8/sources/gcc-build/gcc/../../gcc-3.3.3/gcc/reload1.c:6808: 
undefined reference to `single_set_2'
libbackend.a(reload1.o)(.text+0xfca8):/ora8/sources/gcc-build/gcc/../../gcc-3.3.3/gcc/reload1.c:6817: 
undefined reference to `find_regno_note'
libbackend.a(reload1.o)(.text+0xfd31):/ora8/sources/gcc-build/gcc/../../gcc-3.3.3/gcc/reload1.c:6823: 
undefined reference to `single_set_2'
libbackend.a(reload1.o)(.text+0xfe3d):/ora8/sources/gcc-build/gcc/../../gcc-3.3.3/gcc/reload1.c:6844: 
undefined reference to `single_set_2'
libbackend.a(reload1.o)(.text+0x100d5): In function `do_input_reload':
/ora8/sources/gcc-build/gcc/../../gcc-3.3.3/gcc/reload1.c:6903: 
undefined reference to `count_occurrences'
libbackend.a(reload1.o)(.text+0x1019f):/ora8/sources/gcc-build/gcc/../../gcc-3.3.3/gcc/reload1.c:6912: 
undefined reference to 
`dead_or_set_p'libbackend.a(reload1.o)(.text+0x10354): In function 
`do_output_reload':
/ora8/sources/gcc-build/gcc/../../gcc-3.3.3/gcc/reload1.c:6980: 
undefined reference to `find_reg_note'
libbackend.a(reload1.o)(.text+0x1039c):/ora8/sources/gcc-build/gcc/../../gcc-3.3.3/gcc/reload1.c:6987: 
undefined reference to 
`find_reg_note'libbackend.a(reload1.o)(.text+0x11078): In function 
`emit_reload_insns':
/ora8/sources/gcc-build/gcc/../../gcc-3.3.3/gcc/reload1.c:7221: 
undefined reference to `reg_set_p'
libbackend.a(reload1.o)(.text+0x11749):/ora8/sources/gcc-build/gcc/../../gcc-3.3.3/gcc/reload1.c:7318: 
undefined reference to `single_set_2'
libbackend.a(reload1.o)(.text+0x119ab):/ora8/sources/gcc-build/gcc/../../gcc-3.3.3/gcc/reload1.c:7346: 
undefined reference to `find_regno_note'
libbackend.a(reload1.o)(.text+0x119cd):/ora8/sources/gcc-build/gcc/../../gcc-3.3.3/gcc/reload1.c:7348: 
undefined reference to `find_regno_note'
libbackend.a(reload1.o)(.text+0x125ff): In function `delete_output_reload':
/ora8/sources/gcc-build/gcc/../../gcc-3.3.3/gcc/reload1.c:7665: 
undefined reference to `count_occurrences'
libbackend.a(reload1.o)(.text+0x1262e):/ora8/sources/gcc-build/gcc/../../gcc-3.3.3/gcc/reload1.c:7667: 
undefined reference to `count_occurrences'
libbackend.a(reload1.o)(.text+0x126a9):/ora8/sources/gcc-build/gcc/../../gcc-3.3.3/gcc/reload1.c:7683: 
undefined reference to `reg_mentioned_p'
libbackend.a(reload1.o)(.text+0x128e5):/ora8/sources/gcc-build/gcc/../../gcc-3.3.3/gcc/reload1.c:7714: 
undefined reference to `find_regno_note'
libbackend.a(reload1.o)(.text+0x12941):/ora8/sources/gcc-build/gcc/../../gcc-3.3.3/gcc/reload1.c:7728: 
undefined reference to `single_set_2'
libbackend.a(reload1.o)(.text+0x129a5):/ora8/sources/gcc-build/gcc/../../gcc-3.3.3/gcc/reload1.c:7737: 
undefined reference to `reg_mentioned_p'
libbackend.a(reload1.o)(.text+0x12a31):/ora8/sources/gcc-build/gcc/../../gcc-3.3.3/gcc/reload1.c:7752: 
undefined reference to `single_set_2'
libbackend.a(reload1.o)(.text+0x12b45): In function 
`delete_address_reloads':
/ora8/sources/gcc-build/gcc/../../gcc-3.3.3/gcc/reload1.c:7782: 
undefined reference to `single_set_2'
libbackend.a(reload1.o)(.text+0x12bed):/ora8/sources/gcc-build/gcc/../../gcc-3.3.3/gcc/reload1.c:7796: 
undefined reference to `single_set_2'
libbackend.a(reload1.o)(.text+0x12c3d):/ora8/sources/gcc-build/gcc/../../gcc-3.3.3/gcc/reload1.c:7797: 
undefined reference to `single_set_2'
libbackend.a(reload1.o)(.text+0x12e89): In function 
`delete_address_reloads_1':
/ora8/sources/gcc-build/gcc/../../gcc-3.3.3/gcc/reload1.c:7852: 
undefined reference to `reg_set_p'
libbackend.a(reload1.o)(.text+0x12ea5):/ora8/sources/gcc-build/gcc/../../gcc-3.3.3/gcc/reload1.c:7854: 
undefined reference to `reg_referenced_p'
libbackend.a(reload1.o)(.text+0x12f15):/ora8/sources/gcc-build/gcc/../../gcc-3.3.3/gcc/reload1.c:7860: 
undefined reference to `single_set_2'
libbackend.a(reload1.o)(.text+0x12f79):/ora8/sources/gcc-build/gcc/../../gcc-3.3.3/gcc/reload1.c:7867: 
undefined reference to `reg_set_p'
libbackend.a(reload1.o)(.text+0x12fd1):/ora8/sources/gcc-build/gcc/../../gcc-3.3.3/gcc/reload1.c:7877: 
undefined reference to `reg_referenced_p'
libbackend.a(reload1.o)(.text+0x13135):/ora8/sources/gcc-build/gcc/../../gcc-3.3.3/gcc/reload1.c:7914: 
undefined reference to `reg_set_p'
libbackend.a(reload1.o)(.text+0x13734): In function 
`reload_cse_simplify_set':
/ora8/sources/gcc-build/gcc/../../gcc-3.3.3/gcc/reload1.c:8196: 
undefined reference to `side_effects_p'
libbackend.a(reload1.o)(.text+0x13fe1): In function 
`reload_cse_simplify_operands':
/ora8/sources/gcc-build/gcc/../../gcc-3.3.3/gcc/reload1.c:8461: 
undefined reference to `target_flags'
libbackend.a(reload1.o)(.text+0x13fed):/ora8/sources/gcc-build/gcc/../../gcc-3.3.3/gcc/reload1.c:8461: 
undefined reference to `target_flags'
libbackend.a(reload1.o)(.text+0x14035):/ora8/sources/gcc-build/gcc/../../gcc-3.3.3/gcc/reload1.c:8461: 
undefined reference to `target_flags'
libbackend.a(reload1.o)(.text+0x14041):/ora8/sources/gcc-build/gcc/../../gcc-3.3.3/gcc/reload1.c:8461: 
undefined reference to `target_flags'
libbackend.a(reload1.o)(.text+0x14089):/ora8/sources/gcc-build/gcc/../../gcc-3.3.3/gcc/reload1.c:8461: 
undefined reference to `target_flags'
libbackend.a(reload1.o)(.text+0x14095):/ora8/sources/gcc-build/gcc/../../gcc-3.3.3/gcc/reload1.c:8461: 
more undefined references to `target_flags' follow
libbackend.a(reload1.o)(.text+0x14b2d): In function `reload_combine':
/ora8/sources/gcc-build/gcc/../../gcc-3.3.3/gcc/reload1.c:8694: 
undefined reference to `single_set_2'
libbackend.a(reload1.o)(.text+0x14d1d):/ora8/sources/gcc-build/gcc/../../gcc-3.3.3/gcc/reload1.c:8709: 
undefined reference to `single_set_2'
libbackend.a(reload1.o)(.text+0x15129):/ora8/sources/gcc-build/gcc/../../gcc-3.3.3/gcc/reload1.c:8812: 
undefined reference to `note_stores'
libbackend.a(reload1.o)(.text+0x154ab): In function 
`reload_combine_note_store':
/ora8/sources/gcc-build/gcc/../../gcc-3.3.3/gcc/reload1.c:8898: 
undefined reference to `subreg_regno_offset'
libbackend.a(reload1.o)(.text+0x15f89): In function `reload_cse_move2add':
/ora8/sources/gcc-build/gcc/../../gcc-3.3.3/gcc/reload1.c:9208: 
undefined reference to `single_set_2'
libbackend.a(reload1.o)(.text+0x161b9):/ora8/sources/gcc-build/gcc/../../gcc-3.3.3/gcc/reload1.c:9259: 
undefined reference to `note_stores'
libbackend.a(reload1.o)(.text+0x1625c): In function `move2add_note_store':
/ora8/sources/gcc-build/gcc/../../gcc-3.3.3/gcc/reload1.c:9289: 
undefined reference to `subreg_regno_offset'
libbackend.a(reload1.o)(.text+0x1683e): In function `copy_eh_notes':
/ora8/sources/gcc-build/gcc/../../gcc-3.3.3/gcc/reload1.c:9456: 
undefined reference to `find_reg_note'
libbackend.a(reload1.o)(.text+0x16862):/ora8/sources/gcc-build/gcc/../../gcc-3.3.3/gcc/reload1.c:9461: 
undefined reference to `may_trap_p'
libbackend.a(sibcall.o)(.text+0x171): In function 
`identify_call_return_value':
/ora8/sources/gcc-build/gcc/../../gcc-3.3.3/gcc/sibcall.c:106: undefined 
reference to `single_set_2'
libbackend.a(sibcall.o)(.text+0x1f9):/ora8/sources/gcc-build/gcc/../../gcc-3.3.3/gcc/sibcall.c:116: 
undefined reference to `single_set_2'
libbackend.a(sibcall.o)(.text+0x260):/ora8/sources/gcc-build/gcc/../../gcc-3.3.3/gcc/sibcall.c:129: 
undefined reference to `reg_set_between_p'
libbackend.a(sibcall.o)(.text+0x315): In function 
`skip_copy_to_return_value':
/ora8/sources/gcc-build/gcc/../../gcc-3.3.3/gcc/sibcall.c:157: undefined 
reference to `single_set_2'
libbackend.a(sibcall.o)(.text+0x431):/ora8/sources/gcc-build/gcc/../../gcc-3.3.3/gcc/sibcall.c:200: 
undefined reference to `single_set_2'
libbackend.a(sibcall.o)(.text+0x5c5): In function `skip_unreturned_value':
/ora8/sources/gcc-build/gcc/../../gcc-3.3.3/gcc/sibcall.c:257: undefined 
reference to `single_set_2'
libbackend.a(sibcall.o)(.text+0x679): In function `skip_stack_adjustment':
/ora8/sources/gcc-build/gcc/../../gcc-3.3.3/gcc/sibcall.c:280: undefined 
reference to `single_set_2'
libbackend.a(sibcall.o)(.text+0x741): In function `skip_pic_restore':
/ora8/sources/gcc-build/gcc/../../gcc-3.3.3/gcc/sibcall.c:305: undefined 
reference to `single_set_2'
libbackend.a(sibcall.o)(.text+0xb6b): In function `purge_reg_equiv_notes':
/ora8/sources/gcc-build/gcc/../../gcc-3.3.3/gcc/sibcall.c:483: undefined 
reference to `find_reg_note'
libbackend.a(sibcall.o)(.text+0xb85):/ora8/sources/gcc-build/gcc/../../gcc-3.3.3/gcc/sibcall.c:488: 
undefined reference to `remove_note'
libbackend.a(sibcall.o)(.text+0xec1): In function 
`optimize_sibling_and_tail_recursive_calls':
/ora8/sources/gcc-build/gcc/../../gcc-3.3.3/gcc/sibcall.c:631: undefined 
reference to `single_set_2'
libbackend.a(simplify-rtx.o)(.text+0x3c): In function `simplify_gen_binary':
/ora8/sources/gcc-build/gcc/../../gcc-3.3.3/gcc/simplify-rtx.c:114: 
undefined reference to `swap_commutative_operands_p'
libbackend.a(simplify-rtx.o)(.text+0x25d): In function 
`simplify_gen_relational':
/ora8/sources/gcc-build/gcc/../../gcc-3.3.3/gcc/simplify-rtx.c:225: 
undefined reference to `swap_commutative_operands_p'
libbackend.a(simplify-rtx.o)(.text+0x32e):/ora8/sources/gcc-build/gcc/../../gcc-3.3.3/gcc/simplify-rtx.c:250: 
undefined reference to `swap_commutative_operands_p'
libbackend.a(simplify-rtx.o)(.text+0x145a): In function 
`simplify_binary_operation':
/ora8/sources/gcc-build/gcc/../../gcc-3.3.3/gcc/simplify-rtx.c:796: 
undefined reference to `swap_commutative_operands_p'
libbackend.a(simplify-rtx.o)(.text+0x226c):/ora8/sources/gcc-build/gcc/../../gcc-3.3.3/gcc/simplify-rtx.c:1102: 
undefined reference to `side_effects_p'
libbackend.a(simplify-rtx.o)(.text+0x2910):/ora8/sources/gcc-build/gcc/../../gcc-3.3.3/gcc/simplify-rtx.c:1230: 
undefined reference to `side_effects_p'
libbackend.a(simplify-rtx.o)(.text+0x2b1c):/ora8/sources/gcc-build/gcc/../../gcc-3.3.3/gcc/simplify-rtx.c:1277: 
undefined reference to `side_effects_p'
libbackend.a(simplify-rtx.o)(.text+0x2b83):/ora8/sources/gcc-build/gcc/../../gcc-3.3.3/gcc/simplify-rtx.c:1280: 
undefined reference to `side_effects_p'
libbackend.a(simplify-rtx.o)(.text+0x2c1b):/ora8/sources/gcc-build/gcc/../../gcc-3.3.3/gcc/simplify-rtx.c:1294: 
undefined reference to `side_effects_p'
libbackend.a(simplify-rtx.o)(.text+0x2c5a):/ora8/sources/gcc-build/gcc/../../gcc-3.3.3/gcc/simplify-rtx.c:1300: 
more undefined references to `side_effects_p' follow
libbackend.a(simplify-rtx.o)(.text+0x36e0): In function 
`simplify_plus_minus_op_data_cmp':
/ora8/sources/gcc-build/gcc/../../gcc-3.3.3/gcc/simplify-rtx.c:1657: 
undefined reference to `commutative_operand_precedence'
libbackend.a(simplify-rtx.o)(.text+0x36f2):/ora8/sources/gcc-build/gcc/../../gcc-3.3.3/gcc/simplify-rtx.c:1657: 
undefined reference to `commutative_operand_precedence'
libbackend.a(simplify-rtx.o)(.text+0x3cc6): In function 
`simplify_plus_minus':
/ora8/sources/gcc-build/gcc/../../gcc-3.3.3/gcc/simplify-rtx.c:1794: 
undefined reference to `swap_commutative_operands_p'
libbackend.a(simplify-rtx.o)(.text+0x42a2): In function 
`simplify_relational_operation':
/ora8/sources/gcc-build/gcc/../../gcc-3.3.3/gcc/simplify-rtx.c:1944: 
undefined reference to `swap_commutative_operands_p'
libbackend.a(simplify-rtx.o)(.text+0x4450):/ora8/sources/gcc-build/gcc/../../gcc-3.3.3/gcc/simplify-rtx.c:1977: 
undefined reference to `side_effects_p'
libbackend.a(simplify-rtx.o)(.text+0x51a4): In function 
`simplify_ternary_operation':
/ora8/sources/gcc-build/gcc/../../gcc-3.3.3/gcc/simplify-rtx.c:2265: 
undefined reference to `side_effects_p'
libbackend.a(simplify-rtx.o)(.text+0x5234):/ora8/sources/gcc-build/gcc/../../gcc-3.3.3/gcc/simplify-rtx.c:2270: 
undefined reference to `side_effects_p'
libbackend.a(simplify-rtx.o)(.text+0x52ca):/ora8/sources/gcc-build/gcc/../../gcc-3.3.3/gcc/simplify-rtx.c:2275: 
undefined reference to `side_effects_p'
libbackend.a(simplify-rtx.o)(.text+0x6418): In function `simplify_rtx':
/ora8/sources/gcc-build/gcc/../../gcc-3.3.3/gcc/simplify-rtx.c:2819: 
undefined reference to `swap_commutative_operands_p'
libbackend.a(ssa.o)(.text+0x49c): In function `find_evaluations':
/ora8/sources/gcc-build/gcc/../../gcc-3.3.3/gcc/ssa.c:490: undefined 
reference to `note_stores'
libbackend.a(ssa.o)(.text+0x1139): In function `rename_insn_1':
/ora8/sources/gcc-build/gcc/../../gcc-3.3.3/gcc/ssa.c:894: undefined 
reference to `for_each_rtx'
libbackend.a(ssa.o)(.text+0x11ad):/ora8/sources/gcc-build/gcc/../../gcc-3.3.3/gcc/ssa.c:912: 
undefined reference to `for_each_rtx'
libbackend.a(ssa.o)(.text+0x1411): In function `rename_block':
/ora8/sources/gcc-build/gcc/../../gcc-3.3.3/gcc/ssa.c:1026: undefined 
reference to `for_each_rtx'
libbackend.a(ssa.o)(.text+0x142c):/ora8/sources/gcc-build/gcc/../../gcc-3.3.3/gcc/ssa.c:1027: 
undefined reference to `for_each_rtx'
libbackend.a(ssa.o)(.text+0x308b): In function `mark_phi_and_copy_regs':
/ora8/sources/gcc-build/gcc/../../gcc-3.3.3/gcc/ssa.c:1999: undefined 
reference to `for_each_rtx'
libbackend.a(ssa.o)(.text+0x350c):/ora8/sources/gcc-build/gcc/../../gcc-3.3.3/gcc/ssa.c:2140: 
more undefined references to `for_each_rtx' follow
libbackend.a(stmt.o)(.text+0x54c): In function `expand_goto':
/ora8/sources/gcc-build/gcc/../../gcc-3.3.3/gcc/stmt.c:655: undefined 
reference to `replace_rtx'
libbackend.a(stmt.o)(.text+0x587):/ora8/sources/gcc-build/gcc/../../gcc-3.3.3/gcc/stmt.c:662: 
undefined reference to `replace_rtx'
libbackend.a(stmt.o)(.text+0x11c1): In function `parse_output_constraint':
/ora8/sources/gcc-build/gcc/../../gcc-3.3.3/gcc/stmt.c:1274: undefined 
reference to `target_flags'
libbackend.a(stmt.o)(.text+0x11d1):/ora8/sources/gcc-build/gcc/../../gcc-3.3.3/gcc/stmt.c:1274: 
undefined reference to `target_flags'
libbackend.a(stmt.o)(.text+0x11f1):/ora8/sources/gcc-build/gcc/../../gcc-3.3.3/gcc/stmt.c:1274: 
undefined reference to `target_flags'
libbackend.a(stmt.o)(.text+0x1201):/ora8/sources/gcc-build/gcc/../../gcc-3.3.3/gcc/stmt.c:1274: 
undefined reference to `target_flags'
libbackend.a(stmt.o)(.text+0x1221):/ora8/sources/gcc-build/gcc/../../gcc-3.3.3/gcc/stmt.c:1274: 
undefined reference to `target_flags'
libbackend.a(stmt.o)(.text+0x1231):/ora8/sources/gcc-build/gcc/../../gcc-3.3.3/gcc/stmt.c:1274: 
more undefined references to `target_flags' follow
libbackend.a(stmt.o)(.text+0x29aa): In function `expand_asm_operands':
/ora8/sources/gcc-build/gcc/../../gcc-3.3.3/gcc/stmt.c:1888: undefined 
reference to `reg_overlap_mentioned_p'
libbackend.a(stmt.o)(.text+0x2a09):/ora8/sources/gcc-build/gcc/../../gcc-3.3.3/gcc/stmt.c:1892: 
undefined reference to `reg_overlap_mentioned_p'
libbackend.a(stmt.o)(.text+0x377f): In function `expand_end_stmt_expr':
/ora8/sources/gcc-build/gcc/../../gcc-3.3.3/gcc/stmt.c:2411: undefined 
reference to `volatile_refs_p'
libbackend.a(stmt.o)(.text+0x5056): In function `tail_recursion_args':
/ora8/sources/gcc-build/gcc/../../gcc-3.3.3/gcc/stmt.c:3331: undefined 
reference to `reg_mentioned_p'
libbackend.a(toplev.o)(.text+0x2999): In function `rest_of_compilation':
/ora8/sources/gcc-build/gcc/../../gcc-3.3.3/gcc/toplev.c:3208: undefined 
reference to `schedule_insns'
libbackend.a(toplev.o)(.text+0x2eeb):/ora8/sources/gcc-build/gcc/../../gcc-3.3.3/gcc/toplev.c:3425: 
undefined reference to `regrename_optimize'
libbackend.a(toplev.o)(.text+0x2ef9):/ora8/sources/gcc-build/gcc/../../gcc-3.3.3/gcc/toplev.c:3427: 
undefined reference to `copyprop_hardreg_forward'
libbackend.a(toplev.o)(.text+0x2fba):/ora8/sources/gcc-build/gcc/../../gcc-3.3.3/gcc/toplev.c:3455: 
undefined reference to `schedule_insns'
libbackend.a(toplev.o)(.text+0x4fd5): In function `set_target_switch':
/ora8/sources/gcc-build/gcc/../../gcc-3.3.3/gcc/toplev.c:4526: undefined 
reference to `target_flags'
libbackend.a(toplev.o)(.text+0x4ff0):/ora8/sources/gcc-build/gcc/../../gcc-3.3.3/gcc/toplev.c:4528: 
undefined reference to `target_flags'
libbackend.a(toplev.o)(.text+0x54b9): In function `print_switch_values':
/ora8/sources/gcc-build/gcc/../../gcc-3.3.3/gcc/toplev.c:4674: undefined 
reference to `target_flags'
libbackend.a(toplev.o)(.text+0x5b0e): In function 
`parse_options_and_default_flags':
/ora8/sources/gcc-build/gcc/../../gcc-3.3.3/gcc/toplev.c:4944: undefined 
reference to `target_flags'
libbackend.a(toplev.o)(.text+0x614e): In function `process_options':
/ora8/sources/gcc-build/gcc/../../gcc-3.3.3/gcc/toplev.c:5203: undefined 
reference to `target_flags'
libbackend.a(tree.o)(.text+0x6c82):/ora8/sources/gcc-build/gcc/../../gcc-3.3.3/gcc/tree.c:4800: 
more undefined references to `target_flags' follow
libbackend.a(unroll.o)(.text+0x8df): In function `unroll_loop':
/ora8/sources/gcc-build/gcc/../../gcc-3.3.3/gcc/unroll.c:723: undefined 
reference to `find_reg_note'
libbackend.a(unroll.o)(.text+0x2069): In function `calculate_giv_inc':
/ora8/sources/gcc-build/gcc/../../gcc-3.3.3/gcc/unroll.c:1597: undefined 
reference to `single_set_2'
libbackend.a(unroll.o)(.text+0x20e4):/ora8/sources/gcc-build/gcc/../../gcc-3.3.3/gcc/unroll.c:1612: 
undefined reference to `find_last_value'
libbackend.a(unroll.o)(.text+0x211c):/ora8/sources/gcc-build/gcc/../../gcc-3.3.3/gcc/unroll.c:1624: 
undefined reference to `find_reg_note'
libbackend.a(unroll.o)(.text+0x218d):/ora8/sources/gcc-build/gcc/../../gcc-3.3.3/gcc/unroll.c:1640: 
undefined reference to `find_last_value'
libbackend.a(unroll.o)(.text+0x2349):/ora8/sources/gcc-build/gcc/../../gcc-3.3.3/gcc/unroll.c:1686: 
undefined reference to `single_set_2'
libbackend.a(unroll.o)(.text+0x2605): In function `copy_loop_body':
/ora8/sources/gcc-build/gcc/../../gcc-3.3.3/gcc/unroll.c:1834: undefined 
reference to `single_set_2'
libbackend.a(unroll.o)(.text+0x2871):/ora8/sources/gcc-build/gcc/../../gcc-3.3.3/gcc/unroll.c:1928: 
undefined reference to `single_set_2'
libbackend.a(unroll.o)(.text+0x2b90):/ora8/sources/gcc-build/gcc/../../gcc-3.3.3/gcc/unroll.c:2052: 
undefined reference to `find_reg_note'
libbackend.a(unroll.o)(.text+0x2bc2):/ora8/sources/gcc-build/gcc/../../gcc-3.3.3/gcc/unroll.c:2054: 
undefined reference to `remove_note'
libbackend.a(unroll.o)(.text+0x2de9):/ora8/sources/gcc-build/gcc/../../gcc-3.3.3/gcc/unroll.c:2154: 
undefined reference to `single_set_2'
libbackend.a(unroll.o)(.text+0x3752): In function `find_splittable_regs':
/ora8/sources/gcc-build/gcc/../../gcc-3.3.3/gcc/unroll.c:2553: undefined 
reference to `reg_mentioned_p'
libbackend.a(unroll.o)(.text+0x37e1):/ora8/sources/gcc-build/gcc/../../gcc-3.3.3/gcc/unroll.c:2567: 
undefined reference to `single_set_2'
libbackend.a(unroll.o)(.text+0x3c92): In function `find_splittable_givs':
/ora8/sources/gcc-build/gcc/../../gcc-3.3.3/gcc/unroll.c:2737: undefined 
reference to `find_reg_note'
libbackend.a(unroll.o)(.text+0x4136): In function `reg_dead_after_loop':
/ora8/sources/gcc-build/gcc/../../gcc-3.3.3/gcc/unroll.c:2959: undefined 
reference to `reg_referenced_p'
libbackend.a(unroll.o)(.text+0x4153):/ora8/sources/gcc-build/gcc/../../gcc-3.3.3/gcc/unroll.c:2962: 
undefined reference to `find_reg_equal_equiv_note'
libbackend.a(unroll.o)(.text+0x4170):/ora8/sources/gcc-build/gcc/../../gcc-3.3.3/gcc/unroll.c:2963: 
undefined reference to `reg_overlap_mentioned_p'
libbackend.a(unroll.o)(.text+0x41bd):/ora8/sources/gcc-build/gcc/../../gcc-3.3.3/gcc/unroll.c:2966: 
undefined reference to `single_set_2'
libbackend.a(unroll.o)(.text+0x4761): In function `loop_find_equiv_value':
/ora8/sources/gcc-build/gcc/../../gcc-3.3.3/gcc/unroll.c:3212: undefined 
reference to `reg_set_p'
libbackend.a(unroll.o)(.text+0x47a5):/ora8/sources/gcc-build/gcc/../../gcc-3.3.3/gcc/unroll.c:3217: 
undefined reference to `single_set_2'
libbackend.a(unroll.o)(.text+0x47e3):/ora8/sources/gcc-build/gcc/../../gcc-3.3.3/gcc/unroll.c:3220: 
undefined reference to `find_reg_note'
libbackend.a(unroll.o)(.text+0x4886):/ora8/sources/gcc-build/gcc/../../gcc-3.3.3/gcc/unroll.c:3233: 
undefined reference to `modified_between_p'
libbackend.a(unroll.o)(.text+0x5b6d): In function `set_dominates_use':
/ora8/sources/gcc-build/gcc/../../gcc-3.3.3/gcc/unroll.c:4035: undefined 
reference to `dead_or_set_regno_p'
libbackend.a(varasm.o)(.text+0x2a7c): In function `assemble_real':
/ora8/sources/gcc-build/gcc/../../gcc-3.3.3/gcc/varasm.c:2014: undefined 
reference to `target_flags'
libbackend.a(varasm.o)(.text+0x2b28):/ora8/sources/gcc-build/gcc/../../gcc-3.3.3/gcc/varasm.c:2020: 
undefined reference to `target_flags'
libbackend.a(varasm.o)(.text+0x524c): In function `mark_constant':
/ora8/sources/gcc-build/gcc/../../gcc-3.3.3/gcc/varasm.c:3658: undefined 
reference to `for_each_rtx'
libbackend.a(i386.o)(.text+0x2a0): In function `override_options':
/ora8/sources/gcc-build/gcc/../../gcc-3.3.3/gcc/config/i386/i386.c:1082: 
undefined reference to `target_flags'
libbackend.a(i386.o)(.text+0x2b1):/ora8/sources/gcc-build/gcc/../../gcc-3.3.3/gcc/config/i386/i386.c:1083: 
undefined reference to `target_flags'
libbackend.a(i386.o)(.text+0x36d):/ora8/sources/gcc-build/gcc/../../gcc-3.3.3/gcc/config/i386/i386.c:1094: 
undefined reference to `target_flags'
libbackend.a(i386.o)(.text+0x39e):/ora8/sources/gcc-build/gcc/../../gcc-3.3.3/gcc/config/i386/i386.c:1097: 
undefined reference to `target_flags'
libbackend.a(i386.o)(.text+0x3cf):/ora8/sources/gcc-build/gcc/../../gcc-3.3.3/gcc/config/i386/i386.c:1100: 
undefined reference to `target_flags'
libbackend.a(i386.o)(.text+0x400):/ora8/sources/gcc-build/gcc/../../gcc-3.3.3/gcc/config/i386/i386.c:1103: 
more undefined references to `target_flags' follow
libbackend.a(i386.o)(.text+0x83f1): In function 
`get_some_local_dynamic_name':
/ora8/sources/gcc-build/gcc/../../gcc-3.3.3/gcc/config/i386/i386.c:6705: 
undefined reference to `for_each_rtx'
libbackend.a(i386.o)(.text+0x89de): In function `print_operand':
/ora8/sources/gcc-build/gcc/../../gcc-3.3.3/gcc/config/i386/i386.c:6991: 
undefined reference to `find_reg_note'
libbackend.a(i386.o)(.text+0x99a8): In function `output_387_binary_op':
/ora8/sources/gcc-build/gcc/../../gcc-3.3.3/gcc/config/i386/i386.c:7503: 
undefined reference to `find_regno_note'
libbackend.a(i386.o)(.text+0x9a60):/ora8/sources/gcc-build/gcc/../../gcc-3.3.3/gcc/config/i386/i386.c:7539: 
undefined reference to `find_regno_note'
libbackend.a(i386.o)(.text+0x9ab0):/ora8/sources/gcc-build/gcc/../../gcc-3.3.3/gcc/config/i386/i386.c:7562: 
undefined reference to `find_regno_note'
libbackend.a(i386.o)(.text+0x9c75): In function `output_fix_trunc':
/ora8/sources/gcc-build/gcc/../../gcc-3.3.3/gcc/config/i386/i386.c:7640: 
undefined reference to `find_regno_note'
libbackend.a(i386.o)(.text+0x9edf): In function `output_fp_compare':
/ora8/sources/gcc-build/gcc/../../gcc-3.3.3/gcc/config/i386/i386.c:7702: 
undefined reference to `find_regno_note'
libbackend.a(i386.o)(.text+0x9f33):/ora8/sources/gcc-build/gcc/../../gcc-3.3.3/gcc/config/i386/i386.c:7704: 
more undefined references to `find_regno_note' follow
libbackend.a(i386.o)(.text+0xaea7): In function `ix86_fp_compare_mode':
/ora8/sources/gcc-build/gcc/../../gcc-3.3.3/gcc/config/i386/i386.c:8319: 
undefined reference to `target_flags'
libbackend.a(i386.o)(.text+0xb3e1): In function `ix86_fp_comparison_codes':
/ora8/sources/gcc-build/gcc/../../gcc-3.3.3/gcc/config/i386/i386.c:8546: 
undefined reference to `target_flags'
libbackend.a(i386.o)(.text+0xb407): In function 
`ix86_fp_comparison_arithmetics_cost':
/ora8/sources/gcc-build/gcc/../../gcc-3.3.3/gcc/config/i386/i386.c:8561: 
undefined reference to `target_flags'
libbackend.a(i386.o)(.text+0xb487): In function 
`ix86_fp_comparison_fcomi_cost':
/ora8/sources/gcc-build/gcc/../../gcc-3.3.3/gcc/config/i386/i386.c:8600: 
undefined reference to `target_flags'
libbackend.a(i386.o)(.text+0xb670): In function `ix86_expand_fp_compare':
/ora8/sources/gcc-build/gcc/../../gcc-3.3.3/gcc/config/i386/i386.c:8670: 
undefined reference to `target_flags'
libbackend.a(i386.o)(.text+0xb86b):/ora8/sources/gcc-build/gcc/../../gcc-3.3.3/gcc/config/i386/i386.c:8718: 
more undefined references to `target_flags' follow
libbackend.a(i386.o)(.text+0xc9da): In function `ix86_expand_int_movcc':
/ora8/sources/gcc-build/gcc/../../gcc-3.3.3/gcc/config/i386/i386.c:9249: 
undefined reference to `reg_overlap_mentioned_p'
libbackend.a(i386.o)(.text+0xc9f2):/ora8/sources/gcc-build/gcc/../../gcc-3.3.3/gcc/config/i386/i386.c:9249: 
undefined reference to `reg_overlap_mentioned_p'
libbackend.a(i386.o)(.text+0xd042):/ora8/sources/gcc-build/gcc/../../gcc-3.3.3/gcc/config/i386/i386.c:9489: 
undefined reference to `target_flags'
libbackend.a(i386.o)(.text+0xd241):/ora8/sources/gcc-build/gcc/../../gcc-3.3.3/gcc/config/i386/i386.c:9560: 
undefined reference to `target_flags'
libbackend.a(i386.o)(.text+0xd473):/ora8/sources/gcc-build/gcc/../../gcc-3.3.3/gcc/config/i386/i386.c:9629: 
undefined reference to `reg_overlap_mentioned_p'
libbackend.a(i386.o)(.text+0xd4c7):/ora8/sources/gcc-build/gcc/../../gcc-3.3.3/gcc/config/i386/i386.c:9635: 
undefined reference to `reg_overlap_mentioned_p'
libbackend.a(i386.o)(.text+0xd65f): In function `ix86_expand_fp_movcc':
/ora8/sources/gcc-build/gcc/../../gcc-3.3.3/gcc/config/i386/i386.c:9676: 
undefined reference to `target_flags'
libbackend.a(i386.o)(.text+0xd6ab):/ora8/sources/gcc-build/gcc/../../gcc-3.3.3/gcc/config/i386/i386.c:9676: 
undefined reference to `target_flags'
libbackend.a(i386.o)(.text+0xd968):/ora8/sources/gcc-build/gcc/../../gcc-3.3.3/gcc/config/i386/i386.c:9730: 
undefined reference to `target_flags'
libbackend.a(i386.o)(.text+0xd9df):/ora8/sources/gcc-build/gcc/../../gcc-3.3.3/gcc/config/i386/i386.c:9743: 
undefined reference to `target_flags'
libbackend.a(i386.o)(.text+0xda07):/ora8/sources/gcc-build/gcc/../../gcc-3.3.3/gcc/config/i386/i386.c:9743: 
undefined reference to `target_flags'
libbackend.a(i386.o)(.text+0xdbd6):/ora8/sources/gcc-build/gcc/../../gcc-3.3.3/gcc/config/i386/i386.c:9786: 
undefined reference to `reg_overlap_mentioned_p'
libbackend.a(i386.o)(.text+0xdc31):/ora8/sources/gcc-build/gcc/../../gcc-3.3.3/gcc/config/i386/i386.c:9792: 
undefined reference to `reg_overlap_mentioned_p'
libbackend.a(i386.o)(.text+0xe03d): In function `ix86_split_to_parts':
/ora8/sources/gcc-build/gcc/../../gcc-3.3.3/gcc/config/i386/i386.c:9895: 
undefined reference to `target_flags'
libbackend.a(i386.o)(.text+0xe207): In function `ix86_split_long_move':
/ora8/sources/gcc-build/gcc/../../gcc-3.3.3/gcc/config/i386/i386.c:10006: 
undefined reference to `reg_overlap_mentioned_p'
libbackend.a(i386.o)(.text+0xe27d):/ora8/sources/gcc-build/gcc/../../gcc-3.3.3/gcc/config/i386/i386.c:10020: 
undefined reference to `reg_overlap_mentioned_p'
libbackend.a(i386.o)(.text+0xe29a):/ora8/sources/gcc-build/gcc/../../gcc-3.3.3/gcc/config/i386/i386.c:10022: 
undefined reference to `reg_overlap_mentioned_p'
libbackend.a(i386.o)(.text+0xe2bd):/ora8/sources/gcc-build/gcc/../../gcc-3.3.3/gcc/config/i386/i386.c:10024: 
undefined reference to `reg_overlap_mentioned_p'
libbackend.a(i386.o)(.text+0xe2e6):/ora8/sources/gcc-build/gcc/../../gcc-3.3.3/gcc/config/i386/i386.c:10029: 
undefined reference to `reg_overlap_mentioned_p'
libbackend.a(i386.o)(.text+0xe4a3):/ora8/sources/gcc-build/gcc/../../gcc-3.3.3/gcc/config/i386/i386.c:10101: 
more undefined references to `reg_overlap_mentioned_p' follow
libbackend.a(i386.o)(.text+0xe7f4): In function `ix86_split_ashldi':
/ora8/sources/gcc-build/gcc/../../gcc-3.3.3/gcc/config/i386/i386.c:10191: 
undefined reference to `target_flags'
libbackend.a(i386.o)(.text+0xeaf8): In function `ix86_split_ashrdi':
/ora8/sources/gcc-build/gcc/../../gcc-3.3.3/gcc/config/i386/i386.c:10251: 
undefined reference to `target_flags'
libbackend.a(i386.o)(.text+0xedb8): In function `ix86_split_lshrdi':
/ora8/sources/gcc-build/gcc/../../gcc-3.3.3/gcc/config/i386/i386.c:10304: 
undefined reference to `target_flags'
libbackend.a(i386.o)(.text+0xf038): In function `ix86_expand_movstr':
/ora8/sources/gcc-build/gcc/../../gcc-3.3.3/gcc/config/i386/i386.c:10382: 
undefined reference to `target_flags'
libbackend.a(i386.o)(.text+0xf2fa):/ora8/sources/gcc-build/gcc/../../gcc-3.3.3/gcc/config/i386/i386.c:10471: 
undefined reference to `target_flags'
libbackend.a(i386.o)(.text+0xf707):/ora8/sources/gcc-build/gcc/../../gcc-3.3.3/gcc/config/i386/i386.c:10606: 
more undefined references to `target_flags' follow
libbackend.a(i386.o)(.text+0x10de9): In function `ix86_flags_dependant':
/ora8/sources/gcc-build/gcc/../../gcc-3.3.3/gcc/config/i386/i386.c:11345: 
undefined reference to `single_set_2'
libbackend.a(i386.o)(.text+0x10eb1):/ora8/sources/gcc-build/gcc/../../gcc-3.3.3/gcc/config/i386/i386.c:11366: 
undefined reference to `reg_overlap_mentioned_p'
libbackend.a(i386.o)(.text+0x10ed7):/ora8/sources/gcc-build/gcc/../../gcc-3.3.3/gcc/config/i386/i386.c:11369: 
undefined reference to `reg_overlap_mentioned_p'
libbackend.a(i386.o)(.text+0x10fd2): In function `ix86_agi_dependant':
/ora8/sources/gcc-build/gcc/../../gcc-3.3.3/gcc/config/i386/i386.c:11412: 
undefined reference to `modified_in_p'
libbackend.a(i386.o)(.text+0x111d9): In function `ix86_adjust_cost':
/ora8/sources/gcc-build/gcc/../../gcc-3.3.3/gcc/config/i386/i386.c:11472: 
undefined reference to `single_set_2'
libbackend.a(i386.o)(.text+0x11231):/ora8/sources/gcc-build/gcc/../../gcc-3.3.3/gcc/config/i386/i386.c:11472: 
undefined reference to `single_set_2'
libbackend.a(i386.o)(.text+0x124db): In function `ix86_init_builtins':
/ora8/sources/gcc-build/gcc/../../gcc-3.3.3/gcc/config/i386/i386.c:12463: 
undefined reference to `target_flags'
libbackend.a(i386.o)(.text+0x1342d): In function 
`ix86_init_mmx_sse_builtins':
/ora8/sources/gcc-build/gcc/../../gcc-3.3.3/gcc/config/i386/i386.c:12842: 
undefined reference to `target_flags'
libbackend.a(i386.o)(.text+0x1347d):/ora8/sources/gcc-build/gcc/../../gcc-3.3.3/gcc/config/i386/i386.c:12846: 
undefined reference to `target_flags'
libbackend.a(i386.o)(.text+0x134a9):/ora8/sources/gcc-build/gcc/../../gcc-3.3.3/gcc/config/i386/i386.c:12847: 
undefined reference to `target_flags'
libbackend.a(i386.o)(.text+0x134d5):/ora8/sources/gcc-build/gcc/../../gcc-3.3.3/gcc/config/i386/i386.c:12848: 
undefined reference to `target_flags'
libbackend.a(i386.o)(.text+0x134fe):/ora8/sources/gcc-build/gcc/../../gcc-3.3.3/gcc/config/i386/i386.c:12849: 
more undefined references to `target_flags' follow
libbackend.a(bb-reorder.o)(.text+0x142): In function `make_reorder_chain_1':
/ora8/sources/gcc-build/gcc/../../gcc-3.3.3/gcc/bb-reorder.c:218: 
undefined reference to `find_reg_note'
libbackend.a(bb-reorder.o)(.text+0x432): In function 
`maybe_duplicate_computed_goto_succ':
/ora8/sources/gcc-build/gcc/../../gcc-3.3.3/gcc/bb-reorder.c:161: 
undefined reference to `computed_jump_p'
libbackend.a(caller-save.o)(.text+0xd33): In function 
`save_call_clobbered_regs':
/ora8/sources/gcc-build/gcc/../../gcc-3.3.3/gcc/caller-save.c:410: 
undefined reference to `find_reg_note'
libbackend.a(caller-save.o)(.text+0x13dd):/ora8/sources/gcc-build/gcc/../../gcc-3.3.3/gcc/caller-save.c:456: 
undefined reference to `note_stores'
libbackend.a(caller-save.o)(.text+0x18a4): In function `add_stored_regs':
/ora8/sources/gcc-build/gcc/../../gcc-3.3.3/gcc/caller-save.c:544: 
undefined reference to `subreg_regno_offset'
libbackend.a(caller-save.o)(.text+0x26db): In function `insert_one_insn':
/ora8/sources/gcc-build/gcc/../../gcc-3.3.3/gcc/caller-save.c:869: 
undefined reference to `note_stores'
libbackend.a(cfgbuild.o)(.text+0x142): In function `control_flow_insn_p':
/ora8/sources/gcc-build/gcc/../../gcc-3.3.3/gcc/cfgbuild.c:116: 
undefined reference to `find_reg_note'
libbackend.a(cfgbuild.o)(.text+0x363): In function `find_label_refs':
/ora8/sources/gcc-build/gcc/../../gcc-3.3.3/gcc/cfgbuild.c:214: 
undefined reference to `find_reg_note'
libbackend.a(cfgbuild.o)(.text+0x68b): In function `make_edges':
/ora8/sources/gcc-build/gcc/../../gcc-3.3.3/gcc/cfgbuild.c:342: 
undefined reference to `find_reg_note'
libbackend.a(cfgbuild.o)(.text+0x785):/ora8/sources/gcc-build/gcc/../../gcc-3.3.3/gcc/cfgbuild.c:367: 
undefined reference to `single_set_2'
libbackend.a(cfgbuild.o)(.text+0x807):/ora8/sources/gcc-build/gcc/../../gcc-3.3.3/gcc/cfgbuild.c:383: 
undefined reference to `computed_jump_p'
libbackend.a(cfgbuild.o)(.text+0x964):/ora8/sources/gcc-build/gcc/../../gcc-3.3.3/gcc/cfgbuild.c:435: 
undefined reference to `find_reg_note'
libbackend.a(cfgbuild.o)(.text+0xd33): In function `find_basic_blocks_1':
/ora8/sources/gcc-build/gcc/../../gcc-3.3.3/gcc/cfgbuild.c:580: 
undefined reference to `find_reg_note'
libbackend.a(cfgbuild.o)(.text+0x10a7): In function 
`compute_outgoing_frequencies':
/ora8/sources/gcc-build/gcc/../../gcc-3.3.3/gcc/cfgbuild.c:745: 
undefined reference to `find_reg_note'
libbackend.a(cfgbuild.o)(.text+0x10ca):/ora8/sources/gcc-build/gcc/../../gcc-3.3.3/gcc/cfgbuild.c:751: 
undefined reference to 
`find_reg_note'libbackend.a(cfgcleanup.o)(.text+0x9b1): In function 
`thread_jump':
/ora8/sources/gcc-build/gcc/../../gcc-3.3.3/gcc/cfgcleanup.c:358: 
undefined reference to `side_effects_p'
libbackend.a(cfgcleanup.o)(.text+0xb84):/ora8/sources/gcc-build/gcc/../../gcc-3.3.3/gcc/cfgcleanup.c:408: 
undefined reference to `for_each_rtx'
libbackend.a(cfgcleanup.o)(.text+0x1c70): In function `insns_match_p':
/ora8/sources/gcc-build/gcc/../../gcc-3.3.3/gcc/cfgcleanup.c:988: 
undefined reference to `find_reg_equal_equiv_note'
libbackend.a(cfgcleanup.o)(.text+0x1c81):/ora8/sources/gcc-build/gcc/../../gcc-3.3.3/gcc/cfgcleanup.c:989: 
undefined reference to `find_reg_equal_equiv_note'
libbackend.a(cfgcleanup.o)(.text+0x1d69):/ora8/sources/gcc-build/gcc/../../gcc-3.3.3/gcc/cfgcleanup.c:999: 
undefined reference to `single_set_2'
libbackend.a(cfgcleanup.o)(.text+0x1db9):/ora8/sources/gcc-build/gcc/../../gcc-3.3.3/gcc/cfgcleanup.c:1000: 
undefined reference to `single_set_2'
libbackend.a(cfgcleanup.o)(.text+0x1edc): In function 
`flow_find_cross_jump':
/ora8/sources/gcc-build/gcc/../../gcc-3.3.3/gcc/cfgcleanup.c:1038: 
undefined reference to `side_effects_p'
libbackend.a(cfgcleanup.o)(.text+0x1f2d):/ora8/sources/gcc-build/gcc/../../gcc-3.3.3/gcc/cfgcleanup.c:1046: 
undefined reference to `side_effects_p'
libbackend.a(cfgcleanup.o)(.text+0x2022):/ora8/sources/gcc-build/gcc/../../gcc-3.3.3/gcc/cfgcleanup.c:1076: 
undefined reference to `find_reg_equal_equiv_note'
libbackend.a(cfgcleanup.o)(.text+0x2033):/ora8/sources/gcc-build/gcc/../../gcc-3.3.3/gcc/cfgcleanup.c:1077: 
undefined reference to `find_reg_equal_equiv_note'
libbackend.a(cfgcleanup.o)(.text+0x2053):/ora8/sources/gcc-build/gcc/../../gcc-3.3.3/gcc/cfgcleanup.c:1080: 
undefined reference to `remove_note'
libbackend.a(cfgcleanup.o)(.text+0x2072):/ora8/sources/gcc-build/gcc/../../gcc-3.3.3/gcc/cfgcleanup.c:1082: 
undefined reference to `remove_note'
libbackend.a(cfgcleanup.o)(.text+0x20ad):/ora8/sources/gcc-build/gcc/../../gcc-3.3.3/gcc/cfgcleanup.c:1086: 
undefined reference to `remove_note'
libbackend.a(cfgcleanup.o)(.text+0x20be):/ora8/sources/gcc-build/gcc/../../gcc-3.3.3/gcc/cfgcleanup.c:1087: 
undefined reference to `remove_note'
libbackend.a(cfgcleanup.o)(.text+0x28dc): In function 
`outgoing_edges_match':
/ora8/sources/gcc-build/gcc/../../gcc-3.3.3/gcc/cfgcleanup.c:1329: 
undefined reference to `find_reg_note'
libbackend.a(cfgcleanup.o)(.text+0x28f4):/ora8/sources/gcc-build/gcc/../../gcc-3.3.3/gcc/cfgcleanup.c:1330: 
undefined reference to `find_reg_note'
libbackend.a(cfglayout.o)(.text+0x9d6): In function `fixup_reorder_chain':
/ora8/sources/gcc-build/gcc/../../gcc-3.3.3/gcc/cfglayout.c:481: 
undefined reference to `find_reg_note'
libbackend.a(cfglayout.o)(.text+0xad8):/ora8/sources/gcc-build/gcc/../../gcc-3.3.3/gcc/cfglayout.c:502: 
undefined reference to `find_reg_note'
libbackend.a(combine.o)(.text+0x415): In function `combine_instructions':
/ora8/sources/gcc-build/gcc/../../gcc-3.3.3/gcc/combine.c:611: undefined 
reference to `note_stores'
libbackend.a(combine.o)(.text+0xd9d): In function `can_combine_p':
/ora8/sources/gcc-build/gcc/../../gcc-3.3.3/gcc/combine.c:1024: 
undefined reference to `reg_set_between_p'
libbackend.a(combine.o)(.text+0xddf):/ora8/sources/gcc-build/gcc/../../gcc-3.3.3/gcc/combine.c:1043: 
undefined reference to `find_reg_note'
libbackend.a(combine.o)(.text+0xdf1):/ora8/sources/gcc-build/gcc/../../gcc-3.3.3/gcc/combine.c:1043: 
undefined reference to `side_effects_p'
libbackend.a(combine.o)(.text+0xed9):/ora8/sources/gcc-build/gcc/../../gcc-3.3.3/gcc/combine.c:1077: 
undefined reference to `find_reg_note'
libbackend.a(combine.o)(.text+0xf17):/ora8/sources/gcc-build/gcc/../../gcc-3.3.3/gcc/combine.c:1077: 
undefined reference to 
`find_reg_fusage'libbackend.a(combine.o)(.text+0xf64):/ora8/sources/gcc-build/gcc/../../gcc-3.3.3/gcc/combine.c:1077: 
undefined reference to `reg_used_between_p'
libbackend.a(combine.o)(.text+0xf92):/ora8/sources/gcc-build/gcc/../../gcc-3.3.3/gcc/combine.c:1077: 
undefined reference to `find_reg_note'
libbackend.a(combine.o)(.text+0x102b):/ora8/sources/gcc-build/gcc/../../gcc-3.3.3/gcc/combine.c:1077: 
undefined reference to `find_reg_note'
libbackend.a(combine.o)(.text+0x104c):/ora8/sources/gcc-build/gcc/../../gcc-3.3.3/gcc/combine.c:1077: 
undefined reference to `find_reg_note'
libbackend.a(combine.o)(.text+0x11de):/ora8/sources/gcc-build/gcc/../../gcc-3.3.3/gcc/combine.c:1168: 
undefined reference to `reg_overlap_mentioned_p'
libbackend.a(combine.o)(.text+0x123c):/ora8/sources/gcc-build/gcc/../../gcc-3.3.3/gcc/combine.c:1177: 
undefined reference to `volatile_refs_p'
libbackend.a(combine.o)(.text+0x125c):/ora8/sources/gcc-build/gcc/../../gcc-3.3.3/gcc/combine.c:1180: 
undefined reference to `volatile_refs_p'
libbackend.a(combine.o)(.text+0x12ad):/ora8/sources/gcc-build/gcc/../../gcc-3.3.3/gcc/combine.c:1184: 
undefined reference to `volatile_refs_p'
libbackend.a(combine.o)(.text+0x132d):/ora8/sources/gcc-build/gcc/../../gcc-3.3.3/gcc/combine.c:1199: 
undefined reference to `volatile_insn_p'
libbackend.a(combine.o)(.text+0x150a): In function `combinable_i3pat':
/ora8/sources/gcc-build/gcc/../../gcc-3.3.3/gcc/combine.c:1374: 
undefined reference to `reg_overlap_mentioned_p'
libbackend.a(combine.o)(.text+0x1525):/ora8/sources/gcc-build/gcc/../../gcc-3.3.3/gcc/combine.c:1374: 
undefined reference to `reg_overlap_mentioned_p'
libbackend.a(combine.o)(.text+0x1574):/ora8/sources/gcc-build/gcc/../../gcc-3.3.3/gcc/combine.c:1374: 
undefined reference to `reg_overlap_mentioned_p'
libbackend.a(combine.o)(.text+0x15b4):/ora8/sources/gcc-build/gcc/../../gcc-3.3.3/gcc/combine.c:1400: 
undefined reference to `reg_referenced_p'
libbackend.a(combine.o)(.text+0x17e5): In function `cant_combine_insn_p':
/ora8/sources/gcc-build/gcc/../../gcc-3.3.3/gcc/combine.c:1487: 
undefined reference to `single_set_2'
libbackend.a(combine.o)(.text+0x1b0b): In function `try_combine':
/ora8/sources/gcc-build/gcc/../../gcc-3.3.3/gcc/combine.c:1634: 
undefined reference to `find_reg_note'
libbackend.a(combine.o)(.text+0x1b37):/ora8/sources/gcc-build/gcc/../../gcc-3.3.3/gcc/combine.c:1634: 
undefined reference to 
`side_effects_p'libbackend.a(combine.o)(.text+0x1b83):/ora8/sources/gcc-build/gcc/../../gcc-3.3.3/gcc/combine.c:1634: 
undefined reference to `reg_overlap_mentioned_p'
libbackend.a(combine.o)(.text+0x1c1c):/ora8/sources/gcc-build/gcc/../../gcc-3.3.3/gcc/combine.c:1663: 
undefined reference to `reg_overlap_mentioned_p'
libbackend.a(combine.o)(.text+0x1db1):/ora8/sources/gcc-build/gcc/../../gcc-3.3.3/gcc/combine.c:1698: 
undefined reference to `single_set_2'
libbackend.a(combine.o)(.text+0x2242):/ora8/sources/gcc-build/gcc/../../gcc-3.3.3/gcc/combine.c:1825: 
undefined reference to `reg_overlap_mentioned_p'
libbackend.a(combine.o)(.text+0x2266):/ora8/sources/gcc-build/gcc/../../gcc-3.3.3/gcc/combine.c:1826: 
undefined reference to `reg_overlap_mentioned_p'
libbackend.a(combine.o)(.text+0x229e):/ora8/sources/gcc-build/gcc/../../gcc-3.3.3/gcc/combine.c:1827: 
undefined reference to `reg_overlap_mentioned_p'
libbackend.a(combine.o)(.text+0x22d6):/ora8/sources/gcc-build/gcc/../../gcc-3.3.3/gcc/combine.c:1831: 
undefined reference to `reg_overlap_mentioned_p'
libbackend.a(combine.o)(.text+0x239d):/ora8/sources/gcc-build/gcc/../../gcc-3.3.3/gcc/combine.c:1889: 
undefined reference to `dead_or_set_p'
libbackend.a(combine.o)(.text+0x23d3):/ora8/sources/gcc-build/gcc/../../gcc-3.3.3/gcc/combine.c:1891: 
undefined reference to `dead_or_set_p'
libbackend.a(combine.o)(.text+0x23ea):/ora8/sources/gcc-build/gcc/../../gcc-3.3.3/gcc/combine.c:1891: 
undefined reference to `dead_or_set_p'
libbackend.a(combine.o)(.text+0x23ff):/ora8/sources/gcc-build/gcc/../../gcc-3.3.3/gcc/combine.c:1891: 
undefined reference to `dead_or_set_p'
libbackend.a(combine.o)(.text+0x2b6b):/ora8/sources/gcc-build/gcc/../../gcc-3.3.3/gcc/combine.c:2132: 
undefined reference to `find_reg_note'
libbackend.a(combine.o)(.text+0x2b86):/ora8/sources/gcc-build/gcc/../../gcc-3.3.3/gcc/combine.c:2132: 
undefined reference to 
`side_effects_p'libbackend.a(combine.o)(.text+0x2c47):/ora8/sources/gcc-build/gcc/../../gcc-3.3.3/gcc/combine.c:2145: 
undefined reference to `find_reg_note'
libbackend.a(combine.o)(.text+0x2c62):/ora8/sources/gcc-build/gcc/../../gcc-3.3.3/gcc/combine.c:2145: 
undefined reference to 
`side_effects_p'libbackend.a(combine.o)(.text+0x2d32):/ora8/sources/gcc-build/gcc/../../gcc-3.3.3/gcc/combine.c:2191: 
undefined reference to `reg_overlap_mentioned_p'
libbackend.a(combine.o)(.text+0x2fcd):/ora8/sources/gcc-build/gcc/../../gcc-3.3.3/gcc/combine.c:2239: 
undefined reference to `single_set_2'
libbackend.a(combine.o)(.text+0x3037):/ora8/sources/gcc-build/gcc/../../gcc-3.3.3/gcc/combine.c:2240: 
undefined reference to `single_set_2'
libbackend.a(combine.o)(.text+0x30db):/ora8/sources/gcc-build/gcc/../../gcc-3.3.3/gcc/combine.c:2255: 
undefined reference to `reg_used_between_p'
libbackend.a(combine.o)(.text+0x330f):/ora8/sources/gcc-build/gcc/../../gcc-3.3.3/gcc/combine.c:2291: 
undefined reference to `reg_referenced_p'
libbackend.a(combine.o)(.text+0x37d1):/ora8/sources/gcc-build/gcc/../../gcc-3.3.3/gcc/combine.c:2382: 
undefined reference to `reg_overlap_mentioned_p'
libbackend.a(combine.o)(.text+0x37f5):/ora8/sources/gcc-build/gcc/../../gcc-3.3.3/gcc/combine.c:2382: 
undefined reference to `find_reg_note'
libbackend.a(combine.o)(.text+0x3919):/ora8/sources/gcc-build/gcc/../../gcc-3.3.3/gcc/combine.c:2452: 
undefined reference to `reg_referenced_p'
libbackend.a(combine.o)(.text+0x3af6):/ora8/sources/gcc-build/gcc/../../gcc-3.3.3/gcc/combine.c:2470: 
undefined reference to `reg_referenced_p'
libbackend.a(combine.o)(.text+0x3b1e):/ora8/sources/gcc-build/gcc/../../gcc-3.3.3/gcc/combine.c:2470: 
undefined reference to `reg_referenced_p'
libbackend.a(combine.o)(.text+0x3cd7):/ora8/sources/gcc-build/gcc/../../gcc-3.3.3/gcc/combine.c:2550: 
undefined reference to `reg_set_p'
libbackend.a(combine.o)(.text+0x3d1e):/ora8/sources/gcc-build/gcc/../../gcc-3.3.3/gcc/combine.c:2556: 
undefined reference to `remove_note'
libbackend.a(combine.o)(.text+0x3f72):/ora8/sources/gcc-build/gcc/../../gcc-3.3.3/gcc/combine.c:2628: 
undefined reference to `replace_rtx'
libbackend.a(combine.o)(.text+0x3f8f):/ora8/sources/gcc-build/gcc/../../gcc-3.3.3/gcc/combine.c:2631: 
undefined reference to `replace_rtx'
libbackend.a(combine.o)(.text+0x405b):/ora8/sources/gcc-build/gcc/../../gcc-3.3.3/gcc/combine.c:2651: 
undefined reference to `find_reg_note'
libbackend.a(combine.o)(.text+0x4561):/ora8/sources/gcc-build/gcc/../../gcc-3.3.3/gcc/combine.c:2762: 
undefined reference to `reg_set_p'
libbackend.a(combine.o)(.text+0x4614):/ora8/sources/gcc-build/gcc/../../gcc-3.3.3/gcc/combine.c:2777: 
undefined reference to `reg_set_p'
libbackend.a(combine.o)(.text+0x46c8):/ora8/sources/gcc-build/gcc/../../gcc-3.3.3/gcc/combine.c:2790: 
undefined reference to `reg_set_p'
libbackend.a(combine.o)(.text+0x4805):/ora8/sources/gcc-build/gcc/../../gcc-3.3.3/gcc/combine.c:2816: 
undefined reference to `single_set_2'
libbackend.a(combine.o)(.text+0x48ac):/ora8/sources/gcc-build/gcc/../../gcc-3.3.3/gcc/combine.c:2824: 
undefined reference to `reg_mentioned_p'
libbackend.a(combine.o)(.text+0x497d):/ora8/sources/gcc-build/gcc/../../gcc-3.3.3/gcc/combine.c:2839: 
undefined reference to `single_set_2'
libbackend.a(combine.o)(.text+0x4a51):/ora8/sources/gcc-build/gcc/../../gcc-3.3.3/gcc/combine.c:2854: 
undefined reference to `note_stores'
libbackend.a(combine.o)(.text+0x4a66):/ora8/sources/gcc-build/gcc/../../gcc-3.3.3/gcc/combine.c:2855: 
undefined reference to `note_stores'
libbackend.a(combine.o)(.text+0x4f30): In function `find_split_point':
/ora8/sources/gcc-build/gcc/../../gcc-3.3.3/gcc/combine.c:3016: 
undefined reference to `reg_mentioned_p'
libbackend.a(combine.o)(.text+0x4fc6):/ora8/sources/gcc-build/gcc/../../gcc-3.3.3/gcc/combine.c:3038: 
undefined reference to `replace_rtx'
libbackend.a(combine.o)(.text+0x51b1):/ora8/sources/gcc-build/gcc/../../gcc-3.3.3/gcc/combine.c:3094: 
undefined reference to 
`side_effects_p'libbackend.a(combine.o)(.text+0x63c6): In function 
`combine_simplify_rtx':
/ora8/sources/gcc-build/gcc/../../gcc-3.3.3/gcc/combine.c:3663: 
undefined reference to `swap_commutative_operands_p'
libbackend.a(combine.o)(.text+0x894c): In function `simplify_if_then_else':
/ora8/sources/gcc-build/gcc/../../gcc-3.3.3/gcc/combine.c:4820: 
undefined reference to `reg_mentioned_p'
libbackend.a(combine.o)(.text+0x89a0):/ora8/sources/gcc-build/gcc/../../gcc-3.3.3/gcc/combine.c:4824: 
undefined reference to `reg_mentioned_p'
libbackend.a(combine.o)(.text+0x8b4d):/ora8/sources/gcc-build/gcc/../../gcc-3.3.3/gcc/combine.c:4843: 
undefined reference to `reg_mentioned_p'
libbackend.a(combine.o)(.text+0x8c3f):/ora8/sources/gcc-build/gcc/../../gcc-3.3.3/gcc/combine.c:4875: 
undefined reference to 
`side_effects_p'libbackend.a(combine.o)(.text+0x8c65):/ora8/sources/gcc-build/gcc/../../gcc-3.3.3/gcc/combine.c:4879: 
undefined reference to 
`side_effects_p'libbackend.a(combine.o)(.text+0x8cf1):/ora8/sources/gcc-build/gcc/../../gcc-3.3.3/gcc/combine.c:4884: 
undefined reference to 
`side_effects_p'libbackend.a(combine.o)(.text+0x8dd1):/ora8/sources/gcc-build/gcc/../../gcc-3.3.3/gcc/combine.c:4892: 
undefined reference to 
`side_effects_p'libbackend.a(combine.o)(.text+0x8ec5):/ora8/sources/gcc-build/gcc/../../gcc-3.3.3/gcc/combine.c:4915: 
undefined reference to 
`side_effects_p'libbackend.a(combine.o)(.text+0x8f70):/ora8/sources/gcc-build/gcc/../../gcc-3.3.3/gcc/combine.c:4945: 
more undefined references to `side_effects_p' follow
libbackend.a(combine.o)(.text+0xb2e7): In function 
`expand_field_assignment':
/ora8/sources/gcc-build/gcc/../../gcc-3.3.3/gcc/combine.c:5949: 
undefined reference to `subreg_lsb'
libbackend.a(combine.o)(.text+0xe1db): In function `if_then_else_cond':
/ora8/sources/gcc-build/gcc/../../gcc-3.3.3/gcc/combine.c:7472: 
undefined reference to `side_effects_p'
libbackend.a(combine.o)(.text+0xe387):/ora8/sources/gcc-build/gcc/../../gcc-3.3.3/gcc/combine.c:7503: 
undefined reference to 
`side_effects_p'libbackend.a(combine.o)(.text+0xe6ce): In function 
`known_cond':
/ora8/sources/gcc-build/gcc/../../gcc-3.3.3/gcc/combine.c:7608: 
undefined reference to `side_effects_p'
libbackend.a(combine.o)(.text+0xfcca): In function `nonzero_bits1':
/ora8/sources/gcc-build/gcc/../../gcc-3.3.3/gcc/combine.c:8297: 
undefined reference to `target_flags'
libbackend.a(combine.o)(.text+0xfcd8):/ora8/sources/gcc-build/gcc/../../gcc-3.3.3/gcc/combine.c:8297: 
undefined reference to `target_flags'
libbackend.a(combine.o)(.text+0x12e6d): In function `recog_for_combine':
/ora8/sources/gcc-build/gcc/../../gcc-3.3.3/gcc/combine.c:10059: 
undefined reference to `set_noop_p'
libbackend.a(combine.o)(.text+0x132ea): In function `gen_binary':
/ora8/sources/gcc-build/gcc/../../gcc-3.3.3/gcc/combine.c:10227: 
undefined reference to `swap_commutative_operands_p'
libbackend.a(combine.o)(.text+0x133b6):/ora8/sources/gcc-build/gcc/../../gcc-3.3.3/gcc/combine.c:10255: 
undefined reference to `swap_commutative_operands_p'
libbackend.a(combine.o)(.text+0x13a22): In function `simplify_comparison':
/ora8/sources/gcc-build/gcc/../../gcc-3.3.3/gcc/combine.c:10433: 
undefined reference to `swap_commutative_operands_p'
libbackend.a(combine.o)(.text+0x15be7): In function `record_value_for_reg':
/ora8/sources/gcc-build/gcc/../../gcc-3.3.3/gcc/combine.c:11564: 
undefined reference to `reg_overlap_mentioned_p'
libbackend.a(combine.o)(.text+0x15ca7):/ora8/sources/gcc-build/gcc/../../gcc-3.3.3/gcc/combine.c:11585: 
undefined reference to `replace_rtx'
libbackend.a(combine.o)(.text+0x1633e): In function 
`record_dead_and_set_regs':
/ora8/sources/gcc-build/gcc/../../gcc-3.3.3/gcc/combine.c:11751: 
undefined reference to `note_stores'
libbackend.a(combine.o)(.text+0x163d1): In function `record_promoted_value':
/ora8/sources/gcc-build/gcc/../../gcc-3.3.3/gcc/combine.c:11778: 
undefined reference to `single_set_2'
libbackend.a(combine.o)(.text+0x16d3c): In function `use_crosses_set_p':
/ora8/sources/gcc-build/gcc/../../gcc-3.3.3/gcc/combine.c:12033: 
undefined reference to `target_flags'
libbackend.a(combine.o)(.text+0x16d4a):/ora8/sources/gcc-build/gcc/../../gcc-3.3.3/gcc/combine.c:12033: 
undefined reference to 
`target_flags'libbackend.a(combine.o)(.text+0x17205): In function 
`reg_dead_at_p':
/ora8/sources/gcc-build/gcc/../../gcc-3.3.3/gcc/combine.c:12132: 
undefined reference to `note_stores'
libbackend.a(combine.o)(.text+0x1723b):/ora8/sources/gcc-build/gcc/../../gcc-3.3.3/gcc/combine.c:12136: 
undefined reference to `find_regno_note'
libbackend.a(combine.o)(.text+0x1760a): In function `remove_death':
/ora8/sources/gcc-build/gcc/../../gcc-3.3.3/gcc/combine.c:12274: 
undefined reference to `find_regno_note'
libbackend.a(combine.o)(.text+0x17638):/ora8/sources/gcc-build/gcc/../../gcc-3.3.3/gcc/combine.c:12279: 
undefined reference to `remove_note'
libbackend.a(combine.o)(.text+0x1768c): In function `move_deaths':
/ora8/sources/gcc-build/gcc/../../gcc-3.3.3/gcc/combine.c:12314: 
undefined reference to `reg_set_p'
libbackend.a(combine.o)(.text+0x176a1):/ora8/sources/gcc-build/gcc/../../gcc-3.3.3/gcc/combine.c:12314: 
undefined reference to `reg_referenced_p'
libbackend.a(combine.o)(.text+0x18430): In function `distribute_notes':
/ora8/sources/gcc-build/gcc/../../gcc-3.3.3/gcc/combine.c:12572: 
undefined reference to `may_trap_p'
libbackend.a(combine.o)(.text+0x18459):/ora8/sources/gcc-build/gcc/../../gcc-3.3.3/gcc/combine.c:12574: 
undefined reference to `may_trap_p'
libbackend.a(combine.o)(.text+0x184e4):/ora8/sources/gcc-build/gcc/../../gcc-3.3.3/gcc/combine.c:12615: 
undefined reference to `reg_set_p'
libbackend.a(combine.o)(.text+0x1851a):/ora8/sources/gcc-build/gcc/../../gcc-3.3.3/gcc/combine.c:12620: 
undefined reference to `find_regno_note'
libbackend.a(combine.o)(.text+0x1853b):/ora8/sources/gcc-build/gcc/../../gcc-3.3.3/gcc/combine.c:12620: 
undefined reference to `find_reg_note'
libbackend.a(combine.o)(.text+0x18568):/ora8/sources/gcc-build/gcc/../../gcc-3.3.3/gcc/combine.c:12628: 
undefined reference to `reg_referenced_p'
libbackend.a(combine.o)(.text+0x18595):/ora8/sources/gcc-build/gcc/../../gcc-3.3.3/gcc/combine.c:12628: 
undefined reference to `find_regno_note'
libbackend.a(combine.o)(.text+0x185b7):/ora8/sources/gcc-build/gcc/../../gcc-3.3.3/gcc/combine.c:12628: 
undefined reference to `find_reg_note'
libbackend.a(combine.o)(.text+0x18670):/ora8/sources/gcc-build/gcc/../../gcc-3.3.3/gcc/combine.c:12662: 
undefined reference to `reg_mentioned_p'
libbackend.a(combine.o)(.text+0x1869b):/ora8/sources/gcc-build/gcc/../../gcc-3.3.3/gcc/combine.c:12665: 
undefined reference to `reg_mentioned_p'
libbackend.a(combine.o)(.text+0x186d8):/ora8/sources/gcc-build/gcc/../../gcc-3.3.3/gcc/combine.c:12679: 
undefined reference to `reg_mentioned_p'
libbackend.a(combine.o)(.text+0x186ee):/ora8/sources/gcc-build/gcc/../../gcc-3.3.3/gcc/combine.c:12679: 
undefined reference to `find_reg_note'
libbackend.a(combine.o)(.text+0x1873c):/ora8/sources/gcc-build/gcc/../../gcc-3.3.3/gcc/combine.c:12685: 
undefined reference to `reg_mentioned_p'
libbackend.a(combine.o)(.text+0x18752):/ora8/sources/gcc-build/gcc/../../gcc-3.3.3/gcc/combine.c:12685: 
undefined reference to `find_reg_note'
libbackend.a(combine.o)(.text+0x18886):/ora8/sources/gcc-build/gcc/../../gcc-3.3.3/gcc/combine.c:12733: 
undefined reference to `find_reg_note'
libbackend.a(combine.o)(.text+0x18902):/ora8/sources/gcc-build/gcc/../../gcc-3.3.3/gcc/combine.c:12750: 
undefined reference to `find_reg_note'
libbackend.a(combine.o)(.text+0x1897a):/ora8/sources/gcc-build/gcc/../../gcc-3.3.3/gcc/combine.c:12776: 
undefined reference to `find_reg_fusage'
libbackend.a(combine.o)(.text+0x189a0):/ora8/sources/gcc-build/gcc/../../gcc-3.3.3/gcc/combine.c:12780: 
undefined reference to `reg_referenced_p'
libbackend.a(combine.o)(.text+0x189dd):/ora8/sources/gcc-build/gcc/../../gcc-3.3.3/gcc/combine.c:12782: 
undefined reference to `reg_referenced_p'
libbackend.a(combine.o)(.text+0x18a4c):/ora8/sources/gcc-build/gcc/../../gcc-3.3.3/gcc/combine.c:12802: 
undefined reference to `reg_set_p'
libbackend.a(combine.o)(.text+0x18a91):/ora8/sources/gcc-build/gcc/../../gcc-3.3.3/gcc/combine.c:12804: 
undefined reference to 
`single_set_2'libbackend.a(combine.o)(.text+0x18b04):/ora8/sources/gcc-build/gcc/../../gcc-3.3.3/gcc/combine.c:12826: 
undefined reference to `side_effects_p'
libbackend.a(combine.o)(.text+0x18b8c):/ora8/sources/gcc-build/gcc/../../gcc-3.3.3/gcc/combine.c:12871: 
undefined reference to `reg_referenced_p'
libbackend.a(combine.o)(.text+0x18baf):/ora8/sources/gcc-build/gcc/../../gcc-3.3.3/gcc/combine.c:12876: 
undefined reference to `find_regno_note'
libbackend.a(combine.o)(.text+0x18bfd):/ora8/sources/gcc-build/gcc/../../gcc-3.3.3/gcc/combine.c:12888: 
undefined reference to `find_regno_note'
libbackend.a(combine.o)(.text+0x18c28):/ora8/sources/gcc-build/gcc/../../gcc-3.3.3/gcc/combine.c:12894: 
undefined reference to `reg_referenced_p'
libbackend.a(combine.o)(.text+0x18c4f):/ora8/sources/gcc-build/gcc/../../gcc-3.3.3/gcc/combine.c:12894: 
undefined reference to `find_reg_fusage'
libbackend.a(combine.o)(.text+0x18d98):/ora8/sources/gcc-build/gcc/../../gcc-3.3.3/gcc/combine.c:12906: 
undefined reference to `reg_referenced_p'
libbackend.a(combine.o)(.text+0x18e98):/ora8/sources/gcc-build/gcc/../../gcc-3.3.3/gcc/combine.c:12950: 
undefined reference to `noop_move_p'
libbackend.a(combine.o)(.text+0x18f07):/ora8/sources/gcc-build/gcc/../../gcc-3.3.3/gcc/combine.c:12956: 
undefined reference to `dead_or_set_p'
libbackend.a(combine.o)(.text+0x1914d):/ora8/sources/gcc-build/gcc/../../gcc-3.3.3/gcc/combine.c:12988: 
undefined reference to `refers_to_regno_p'
libbackend.a(combine.o)(.text+0x19164):/ora8/sources/gcc-build/gcc/../../gcc-3.3.3/gcc/combine.c:12988: 
undefined reference to `find_regno_fusage'
libbackend.a(combine.o)(.text+0x1917e):/ora8/sources/gcc-build/gcc/../../gcc-3.3.3/gcc/combine.c:12988: 
undefined reference to `dead_or_set_regno_p'
libbackend.a(combine.o)(.text+0x191ed):/ora8/sources/gcc-build/gcc/../../gcc-3.3.3/gcc/combine.c:13004: 
undefined reference to `dead_or_set_p'
libbackend.a(combine.o)(.text+0x1924d):/ora8/sources/gcc-build/gcc/../../gcc-3.3.3/gcc/combine.c:13014: 
undefined reference to `refers_to_regno_p'
libbackend.a(combine.o)(.text+0x19268):/ora8/sources/gcc-build/gcc/../../gcc-3.3.3/gcc/combine.c:13014: 
undefined reference to `find_regno_fusage'
libbackend.a(combine.o)(.text+0x19302):/ora8/sources/gcc-build/gcc/../../gcc-3.3.3/gcc/combine.c:13031: 
undefined reference to `dead_or_set_p'
libbackend.a(combine.o)(.text+0x195c3): In function `distribute_links':
/ora8/sources/gcc-build/gcc/../../gcc-3.3.3/gcc/combine.c:13110: 
undefined reference to `single_set_2'
libbackend.a(combine.o)(.text+0x1967c):/ora8/sources/gcc-build/gcc/../../gcc-3.3.3/gcc/combine.c:13133: 
undefined reference to `reg_overlap_mentioned_p'
libbackend.a(combine.o)(.text+0x19694):/ora8/sources/gcc-build/gcc/../../gcc-3.3.3/gcc/combine.c:13135: 
undefined reference to `reg_referenced_p'
libbackend.a(combine.o)(.text+0x196bd):/ora8/sources/gcc-build/gcc/../../gcc-3.3.3/gcc/combine.c:13139: 
undefined reference to `find_reg_fusage'
libbackend.a(conflict.o)(.text+0x733): In function `conflict_graph_compute':
/ora8/sources/gcc-build/gcc/../../gcc-3.3.3/gcc/conflict.c:482: 
undefined reference to `note_stores'
libbackend.a(df.o)(.text+0x1353): In function `df_ref_record':
/ora8/sources/gcc-build/gcc/../../gcc-3.3.3/gcc/df.c:888: undefined 
reference to `subreg_regno_offset'
libbackend.a(df.o)(.text+0x49a0): In function `df_insn_mem_replace':
/ora8/sources/gcc-build/gcc/../../gcc-3.3.3/gcc/df.c:2571: undefined 
reference to `for_each_rtx'
libbackend.a(df.o)(.text+0x4af3): In function `df_refs_reg_replace':
/ora8/sources/gcc-build/gcc/../../gcc-3.3.3/gcc/df.c:2648: undefined 
reference to `for_each_rtx'
libbackend.a(doloop.o)(.text+0xda7): In function `doloop_optimize':
/ora8/sources/gcc-build/gcc/../../gcc-3.3.3/gcc/doloop.c:810: undefined 
reference to `find_reg_note'
libbackend.a(dwarfout.o)(.text+0x15e8): In function `fundamental_type_code':
/ora8/sources/gcc-build/gcc/../../gcc-3.3.3/gcc/dwarfout.c:1839: 
undefined reference to `target_flags'
libbackend.a(global.o)(.text+0x1335): In function `global_conflicts':
/ora8/sources/gcc-build/gcc/../../gcc-3.3.3/gcc/global.c:762: undefined 
reference to `note_stores'
libbackend.a(global.o)(.text+0x1389):/ora8/sources/gcc-build/gcc/../../gcc-3.3.3/gcc/global.c:775: 
undefined reference to `note_stores'
libbackend.a(global.o)(.text+0x13a7):/ora8/sources/gcc-build/gcc/../../gcc-3.3.3/gcc/global.c:794: 
undefined reference to `multiple_sets'
libbackend.a(global.o)(.text+0x1454):/ora8/sources/gcc-build/gcc/../../gcc-3.3.3/gcc/global.c:805: 
undefined reference to `reg_overlap_mentioned_p'
libbackend.a(global.o)(.text+0x14cc):/ora8/sources/gcc-build/gcc/../../gcc-3.3.3/gcc/global.c:819: 
undefined reference to `find_regno_note'
libbackend.a(global.o)(.text+0x15a9): In function `expand_preferences':
/ora8/sources/gcc-build/gcc/../../gcc-3.3.3/gcc/global.c:851: undefined 
reference to `single_set_2'
libbackend.a(global.o)(.text+0x3dd4): In function `set_preference':
/ora8/sources/gcc-build/gcc/../../gcc-3.3.3/gcc/global.c:1625: undefined 
reference to `subreg_regno_offset'
libbackend.a(global.o)(.text+0x3e60):/ora8/sources/gcc-build/gcc/../../gcc-3.3.3/gcc/global.c:1643: 
undefined reference to `subreg_regno_offset'
libbackend.a(global.o)(.text+0x4a08): In function `build_insn_chain':
/ora8/sources/gcc-build/gcc/../../gcc-3.3.3/gcc/global.c:1850: undefined 
reference to `note_stores'
libbackend.a(haifa-sched.o)(.text+0x1f02): In function `reemit_notes':
/ora8/sources/gcc-build/gcc/../../gcc-3.3.3/gcc/haifa-sched.c:1721: 
undefined reference to `remove_note'
libbackend.a(haifa-sched.o)(.text+0x1f39):/ora8/sources/gcc-build/gcc/../../gcc-3.3.3/gcc/haifa-sched.c:1726: 
undefined reference to `remove_note'
libbackend.a(ifcvt.o)(.text+0x286): In function `cond_exec_process_insns':
/ora8/sources/gcc-build/gcc/../../gcc-3.3.3/gcc/ifcvt.c:265: undefined 
reference to `modified_in_p'
libbackend.a(ifcvt.o)(.text+0x615): In function 
`cond_exec_process_if_block':
/ora8/sources/gcc-build/gcc/../../gcc-3.3.3/gcc/ifcvt.c:436: undefined 
reference to `find_reg_note'
libbackend.a(ifcvt.o)(.text+0x17a3): In function `noce_try_cmove_arith':
/ora8/sources/gcc-build/gcc/../../gcc-3.3.3/gcc/ifcvt.c:1107: undefined 
reference to `may_trap_p'
libbackend.a(ifcvt.o)(.text+0x17b5):/ora8/sources/gcc-build/gcc/../../gcc-3.3.3/gcc/ifcvt.c:1107: 
undefined reference to `may_trap_p'
libbackend.a(ifcvt.o)(.text+0x197d):/ora8/sources/gcc-build/gcc/../../gcc-3.3.3/gcc/ifcvt.c:1162: 
undefined reference to `single_set_2'
libbackend.a(ifcvt.o)(.text+0x1ac5):/ora8/sources/gcc-build/gcc/../../gcc-3.3.3/gcc/ifcvt.c:1196: 
undefined reference to `single_set_2'
libbackend.a(ifcvt.o)(.text+0x1ddb): In function `noce_get_alt_condition':
/ora8/sources/gcc-build/gcc/../../gcc-3.3.3/gcc/ifcvt.c:1256: undefined 
reference to `reg_mentioned_p'
libbackend.a(ifcvt.o)(.text+0x1ec7):/ora8/sources/gcc-build/gcc/../../gcc-3.3.3/gcc/ifcvt.c:1295: 
undefined reference to `find_reg_equal_equiv_note'
libbackend.a(ifcvt.o)(.text+0x20e4):/ora8/sources/gcc-build/gcc/../../gcc-3.3.3/gcc/ifcvt.c:1372: 
undefined reference to `reg_mentioned_p'
libbackend.a(ifcvt.o)(.text+0x2133):/ora8/sources/gcc-build/gcc/../../gcc-3.3.3/gcc/ifcvt.c:1380: 
undefined reference to `reg_overlap_mentioned_p'
libbackend.a(ifcvt.o)(.text+0x2188):/ora8/sources/gcc-build/gcc/../../gcc-3.3.3/gcc/ifcvt.c:1385: 
undefined reference to `modified_in_p'
libbackend.a(ifcvt.o)(.text+0x21a0):/ora8/sources/gcc-build/gcc/../../gcc-3.3.3/gcc/ifcvt.c:1385: 
undefined reference to `modified_in_p'
libbackend.a(ifcvt.o)(.text+0x25ff): In function `noce_try_abs':
/ora8/sources/gcc-build/gcc/../../gcc-3.3.3/gcc/ifcvt.c:1539: undefined 
reference to `find_reg_note'
libbackend.a(ifcvt.o)(.text+0x261b):/ora8/sources/gcc-build/gcc/../../gcc-3.3.3/gcc/ifcvt.c:1539: 
undefined reference to `find_reg_note'
libbackend.a(ifcvt.o)(.text+0x2951): In function `noce_get_condition':
/ora8/sources/gcc-build/gcc/../../gcc-3.3.3/gcc/ifcvt.c:1657: undefined 
reference to `modified_in_p'
libbackend.a(ifcvt.o)(.text+0x2a05):/ora8/sources/gcc-build/gcc/../../gcc-3.3.3/gcc/ifcvt.c:1674: 
undefined reference to `modified_in_p'
libbackend.a(ifcvt.o)(.text+0x2a45): In function `noce_operand_ok':
/ora8/sources/gcc-build/gcc/../../gcc-3.3.3/gcc/ifcvt.c:1689: undefined 
reference to `side_effects_p'
libbackend.a(ifcvt.o)(.text+0x2a6b):/ora8/sources/gcc-build/gcc/../../gcc-3.3.3/gcc/ifcvt.c:1691: 
undefined reference to `side_effects_p'
libbackend.a(ifcvt.o)(.text+0x2a87):/ora8/sources/gcc-build/gcc/../../gcc-3.3.3/gcc/ifcvt.c:1694: 
undefined reference to `may_trap_p'
libbackend.a(ifcvt.o)(.text+0x2be5): In function `noce_process_if_block':
/ora8/sources/gcc-build/gcc/../../gcc-3.3.3/gcc/ifcvt.c:1754: undefined 
reference to `single_set_2'
libbackend.a(ifcvt.o)(.text+0x2c99):/ora8/sources/gcc-build/gcc/../../gcc-3.3.3/gcc/ifcvt.c:1773: 
undefined reference to `single_set_2'
libbackend.a(ifcvt.o)(.text+0x2d3d):/ora8/sources/gcc-build/gcc/../../gcc-3.3.3/gcc/ifcvt.c:1785: 
undefined reference to `single_set_2'
libbackend.a(ifcvt.o)(.text+0x2d86):/ora8/sources/gcc-build/gcc/../../gcc-3.3.3/gcc/ifcvt.c:1785: 
undefined reference to `reg_overlap_mentioned_p'
libbackend.a(ifcvt.o)(.text+0x2da4):/ora8/sources/gcc-build/gcc/../../gcc-3.3.3/gcc/ifcvt.c:1785: 
undefined reference to 
`modified_between_p'libbackend.a(ifcvt.o)(.text+0x2db9):/ora8/sources/gcc-build/gcc/../../gcc-3.3.3/gcc/ifcvt.c:1785: 
undefined reference to `reg_overlap_mentioned_p'
libbackend.a(ifcvt.o)(.text+0x2dce):/ora8/sources/gcc-build/gcc/../../gcc-3.3.3/gcc/ifcvt.c:1785: 
undefined reference to `reg_overlap_mentioned_p'
libbackend.a(ifcvt.o)(.text+0x2de9):/ora8/sources/gcc-build/gcc/../../gcc-3.3.3/gcc/ifcvt.c:1785: 
undefined reference to 
`modified_between_p'libbackend.a(ifcvt.o)(.text+0x2e0d):/ora8/sources/gcc-build/gcc/../../gcc-3.3.3/gcc/ifcvt.c:1806: 
undefined reference to `side_effects_p'
libbackend.a(ifcvt.o)(.text+0x2f78):/ora8/sources/gcc-build/gcc/../../gcc-3.3.3/gcc/ifcvt.c:1860: 
undefined reference to `find_reg_note'
libbackend.a(ifcvt.o)(.text+0x2f92):/ora8/sources/gcc-build/gcc/../../gcc-3.3.3/gcc/ifcvt.c:1861: 
undefined reference to `remove_note'
libbackend.a(ifcvt.o)(.text+0x2fb1):/ora8/sources/gcc-build/gcc/../../gcc-3.3.3/gcc/ifcvt.c:1867: 
undefined reference to `side_effects_p'
libbackend.a(ifcvt.o)(.text+0x2fff):/ora8/sources/gcc-build/gcc/../../gcc-3.3.3/gcc/ifcvt.c:1877: 
undefined reference to `rtx_addr_can_trap_p'
libbackend.a(ifcvt.o)(.text+0x3346): In function `merge_if_block':
/ora8/sources/gcc-build/gcc/../../gcc-3.3.3/gcc/ifcvt.c:2057: undefined 
reference to `find_reg_note'
libbackend.a(ifcvt.o)(.text+0x41ae): In function `find_if_case_2':
/ora8/sources/gcc-build/gcc/../../gcc-3.3.3/gcc/ifcvt.c:2792: undefined 
reference to `find_reg_note'
libbackend.a(ifcvt.o)(.text+0x43e8): In function `dead_or_predicable':
/ora8/sources/gcc-build/gcc/../../gcc-3.3.3/gcc/ifcvt.c:2901: undefined 
reference to `find_reg_note'
libbackend.a(ifcvt.o)(.text+0x4455):/ora8/sources/gcc-build/gcc/../../gcc-3.3.3/gcc/ifcvt.c:2966: 
undefined reference to `may_trap_p'
libbackend.a(ifcvt.o)(.text+0x447e):/ora8/sources/gcc-build/gcc/../../gcc-3.3.3/gcc/ifcvt.c:2974: 
undefined reference to `for_each_rtx'
libbackend.a(insn-opinit.o)(.text+0x22): In function `init_all_optabs':
/ora8/sources/gcc-build/gcc/insn-opinit.c:20: undefined reference to 
`target_flags'
libbackend.a(insn-opinit.o)(.text+0x2e):/ora8/sources/gcc-build/gcc/insn-opinit.c:20: 
undefined reference to `target_flags'
libbackend.a(insn-opinit.o)(.text+0x46):/ora8/sources/gcc-build/gcc/insn-opinit.c:22: 
undefined reference to `target_flags'
libbackend.a(insn-opinit.o)(.text+0x53):/ora8/sources/gcc-build/gcc/insn-opinit.c:22: 
undefined reference to `target_flags'
libbackend.a(insn-opinit.o)(.text+0x6c):/ora8/sources/gcc-build/gcc/insn-opinit.c:24: 
undefined reference to `target_flags'
libbackend.a(insn-opinit.o)(.text+0x7a):/ora8/sources/gcc-build/gcc/insn-opinit.c:24: 
more undefined references to `target_flags' follow
libbackend.a(regmove.o)(.text+0xe1): In function `try_auto_increment':
/ora8/sources/gcc-build/gcc/../../gcc-3.3.3/gcc/regmove.c:108: undefined 
reference to `single_set_2'
libbackend.a(regmove.o)(.text+0x429): In function `mark_flags_life_zones':
/ora8/sources/gcc-build/gcc/../../gcc-3.3.3/gcc/regmove.c:292: undefined 
reference to `find_regno_note'
libbackend.a(regmove.o)(.text+0x478):/ora8/sources/gcc-build/gcc/../../gcc-3.3.3/gcc/regmove.c:300: 
undefined reference to `note_stores'
libbackend.a(regmove.o)(.text+0x500): In function `flags_set_1':
/ora8/sources/gcc-build/gcc/../../gcc-3.3.3/gcc/regmove.c:324: undefined 
reference to `reg_overlap_mentioned_p'
libbackend.a(regmove.o)(.text+0x696): In function `optimize_reg_copy_1':
/ora8/sources/gcc-build/gcc/../../gcc-3.3.3/gcc/regmove.c:433: undefined 
reference to `reg_set_p'
libbackend.a(regmove.o)(.text+0x6af):/ora8/sources/gcc-build/gcc/../../gcc-3.3.3/gcc/regmove.c:433: 
undefined reference to `reg_set_p'
libbackend.a(regmove.o)(.text+0x6e6):/ora8/sources/gcc-build/gcc/../../gcc-3.3.3/gcc/regmove.c:433: 
undefined reference to `reg_overlap_mentioned_p'
libbackend.a(regmove.o)(.text+0x711):/ora8/sources/gcc-build/gcc/../../gcc-3.3.3/gcc/regmove.c:433: 
undefined reference to `reg_overlap_mentioned_p'
libbackend.a(regmove.o)(.text+0x72c):/ora8/sources/gcc-build/gcc/../../gcc-3.3.3/gcc/regmove.c:451: 
undefined reference to `find_regno_note'
libbackend.a(regmove.o)(.text+0x7b1):/ora8/sources/gcc-build/gcc/../../gcc-3.3.3/gcc/regmove.c:470: 
undefined reference to `reg_overlap_mentioned_p'
libbackend.a(regmove.o)(.text+0x7cf):/ora8/sources/gcc-build/gcc/../../gcc-3.3.3/gcc/regmove.c:477: 
undefined reference to `reg_mentioned_p'
libbackend.a(regmove.o)(.text+0x80f):/ora8/sources/gcc-build/gcc/../../gcc-3.3.3/gcc/regmove.c:483: 
undefined reference to `reg_overlap_mentioned_p'
libbackend.a(regmove.o)(.text+0x87a):/ora8/sources/gcc-build/gcc/../../gcc-3.3.3/gcc/regmove.c:516: 
undefined reference to `find_regno_note'
libbackend.a(regmove.o)(.text+0x8b6):/ora8/sources/gcc-build/gcc/../../gcc-3.3.3/gcc/regmove.c:522: 
undefined reference to `remove_note'
libbackend.a(regmove.o)(.text+0x98e):/ora8/sources/gcc-build/gcc/../../gcc-3.3.3/gcc/regmove.c:546: 
undefined reference to `remove_note'
libbackend.a(regmove.o)(.text+0x9bc):/ora8/sources/gcc-build/gcc/../../gcc-3.3.3/gcc/regmove.c:552: 
undefined reference to `find_regno_note'
libbackend.a(regmove.o)(.text+0x9dd):/ora8/sources/gcc-build/gcc/../../gcc-3.3.3/gcc/regmove.c:556: 
undefined reference to `remove_note'
libbackend.a(regmove.o)(.text+0xa94):/ora8/sources/gcc-build/gcc/../../gcc-3.3.3/gcc/regmove.c:580: 
undefined reference to `dead_or_set_p'
libbackend.a(regmove.o)(.text+0xb4d): In function `optimize_reg_copy_2':
/ora8/sources/gcc-build/gcc/../../gcc-3.3.3/gcc/regmove.c:621: undefined 
reference to `single_set_2'
libbackend.a(regmove.o)(.text+0xb9d):/ora8/sources/gcc-build/gcc/../../gcc-3.3.3/gcc/regmove.c:622: 
undefined reference to `find_reg_note'
libbackend.a(regmove.o)(.text+0xbce):/ora8/sources/gcc-build/gcc/../../gcc-3.3.3/gcc/regmove.c:643: 
undefined reference to `find_reg_note'
libbackend.a(regmove.o)(.text+0xbda):/ora8/sources/gcc-build/gcc/../../gcc-3.3.3/gcc/regmove.c:643: 
undefined reference to `remove_note'
libbackend.a(regmove.o)(.text+0xc04):/ora8/sources/gcc-build/gcc/../../gcc-3.3.3/gcc/regmove.c:645: 
undefined reference to `find_reg_note'
libbackend.a(regmove.o)(.text+0xc10):/ora8/sources/gcc-build/gcc/../../gcc-3.3.3/gcc/regmove.c:645: 
undefined reference to `remove_note'
libbackend.a(regmove.o)(.text+0xc4c):/ora8/sources/gcc-build/gcc/../../gcc-3.3.3/gcc/regmove.c:632: 
undefined reference to `reg_mentioned_p'
libbackend.a(regmove.o)(.text+0xc6a):/ora8/sources/gcc-build/gcc/../../gcc-3.3.3/gcc/regmove.c:633: 
undefined reference to `replace_rtx'
libbackend.a(regmove.o)(.text+0xcbe):/ora8/sources/gcc-build/gcc/../../gcc-3.3.3/gcc/regmove.c:650: 
undefined reference to `reg_set_p'
libbackend.a(regmove.o)(.text+0xcd5):/ora8/sources/gcc-build/gcc/../../gcc-3.3.3/gcc/regmove.c:650: 
undefined reference to `find_reg_note'
libbackend.a(regmove.o)(.text+0xd5d): In function `optimize_reg_copy_3':
/ora8/sources/gcc-build/gcc/../../gcc-3.3.3/gcc/regmove.c:674: undefined 
reference to `find_reg_note'
libbackend.a(regmove.o)(.text+0xdbc):/ora8/sources/gcc-build/gcc/../../gcc-3.3.3/gcc/regmove.c:680: 
undefined reference to `reg_set_p'
libbackend.a(regmove.o)(.text+0xe29):/ora8/sources/gcc-build/gcc/../../gcc-3.3.3/gcc/regmove.c:689: 
undefined reference to `single_set_2'
libbackend.a(regmove.o)(.text+0xe68):/ora8/sources/gcc-build/gcc/../../gcc-3.3.3/gcc/regmove.c:689: 
undefined reference to `find_reg_note'
libbackend.a(regmove.o)(.text+0xf73):/ora8/sources/gcc-build/gcc/../../gcc-3.3.3/gcc/regmove.c:740: 
undefined reference to `find_reg_note'
libbackend.a(regmove.o)(.text+0xf8d):/ora8/sources/gcc-build/gcc/../../gcc-3.3.3/gcc/regmove.c:742: 
undefined reference to `remove_note'
libbackend.a(regmove.o)(.text+0x1041): In function `copy_src_to_dest':
/ora8/sources/gcc-build/gcc/../../gcc-3.3.3/gcc/regmove.c:775: undefined 
reference to `single_set_2'
libbackend.a(regmove.o)(.text+0x1072):/ora8/sources/gcc-build/gcc/../../gcc-3.3.3/gcc/regmove.c:775: 
undefined reference to 
`reg_mentioned_p'libbackend.a(regmove.o)(.text+0x1267):/ora8/sources/gcc-build/gcc/../../gcc-3.3.3/gcc/regmove.c:846: 
undefined reference to `find_reg_note'
libbackend.a(regmove.o)(.text+0x13af): In function 
`reg_is_remote_constant_p':
/ora8/sources/gcc-build/gcc/../../gcc-3.3.3/gcc/regmove.c:889: undefined 
reference to `single_set_2'
libbackend.a(regmove.o)(.text+0x1471):/ora8/sources/gcc-build/gcc/../../gcc-3.3.3/gcc/regmove.c:905: 
undefined reference to `single_set_2'
libbackend.a(regmove.o)(.text+0x14bb):/ora8/sources/gcc-build/gcc/../../gcc-3.3.3/gcc/regmove.c:912: 
undefined reference to `find_reg_note'
libbackend.a(regmove.o)(.text+0x1513): In function `fixup_match_2':
/ora8/sources/gcc-build/gcc/../../gcc-3.3.3/gcc/regmove.c:950: undefined 
reference to `find_regno_note'
libbackend.a(regmove.o)(.text+0x157f):/ora8/sources/gcc-build/gcc/../../gcc-3.3.3/gcc/regmove.c:966: 
undefined reference to 
`find_regno_note'libbackend.a(regmove.o)(.text+0x15d1):/ora8/sources/gcc-build/gcc/../../gcc-3.3.3/gcc/regmove.c:971: 
undefined reference to `single_set_2'
libbackend.a(regmove.o)(.text+0x1755):/ora8/sources/gcc-build/gcc/../../gcc-3.3.3/gcc/regmove.c:1029: 
undefined reference to `reg_set_p'
libbackend.a(regmove.o)(.text+0x17b3):/ora8/sources/gcc-build/gcc/../../gcc-3.3.3/gcc/regmove.c:1046: 
undefined reference to `find_reg_fusage'
libbackend.a(regmove.o)(.text+0x17cd):/ora8/sources/gcc-build/gcc/../../gcc-3.3.3/gcc/regmove.c:1050: 
undefined reference to `reg_set_p'
libbackend.a(regmove.o)(.text+0x1a11): In function `regmove_optimize':
/ora8/sources/gcc-build/gcc/../../gcc-3.3.3/gcc/regmove.c:1111: 
undefined reference to `single_set_2'
libbackend.a(regmove.o)(.text+0x1b0b):/ora8/sources/gcc-build/gcc/../../gcc-3.3.3/gcc/regmove.c:1129: 
undefined reference to `find_reg_note'
libbackend.a(regmove.o)(.text+0x1e49):/ora8/sources/gcc-build/gcc/../../gcc-3.3.3/gcc/regmove.c:1206: 
undefined reference to `count_occurrences'
libbackend.a(regmove.o)(.text+0x2245):/ora8/sources/gcc-build/gcc/../../gcc-3.3.3/gcc/regmove.c:1304: 
undefined reference to `single_set_2'
libbackend.a(regmove.o)(.text+0x2285):/ora8/sources/gcc-build/gcc/../../gcc-3.3.3/gcc/regmove.c:1313: 
undefined reference to `reg_set_p'
libbackend.a(regmove.o)(.text+0x22fd):/ora8/sources/gcc-build/gcc/../../gcc-3.3.3/gcc/regmove.c:1322: 
undefined reference to `count_occurrences'
libbackend.a(regmove.o)(.text+0x23f7):/ora8/sources/gcc-build/gcc/../../gcc-3.3.3/gcc/regmove.c:1344: 
undefined reference to `find_reg_note'
libbackend.a(regmove.o)(.text+0x246f):/ora8/sources/gcc-build/gcc/../../gcc-3.3.3/gcc/regmove.c:1370: 
undefined reference to `reg_overlap_mentioned_p'
libbackend.a(regmove.o)(.text+0x25c3):/ora8/sources/gcc-build/gcc/../../gcc-3.3.3/gcc/regmove.c:1421: 
undefined reference to `single_set_2'
libbackend.a(regmove.o)(.text+0x26bb):/ora8/sources/gcc-build/gcc/../../gcc-3.3.3/gcc/regmove.c:1446: 
undefined reference to `reg_overlap_mentioned_p'
libbackend.a(regmove.o)(.text+0x26d9):/ora8/sources/gcc-build/gcc/../../gcc-3.3.3/gcc/regmove.c:1446: 
undefined reference to `reg_overlap_mentioned_p'
libbackend.a(regmove.o)(.text+0x2746):/ora8/sources/gcc-build/gcc/../../gcc-3.3.3/gcc/regmove.c:1467: 
undefined reference to `remove_note'
libbackend.a(regmove.o)(.text+0x2760):/ora8/sources/gcc-build/gcc/../../gcc-3.3.3/gcc/regmove.c:1470: 
undefined reference to `reg_overlap_mentioned_p'
libbackend.a(regmove.o)(.text+0x279e):/ora8/sources/gcc-build/gcc/../../gcc-3.3.3/gcc/regmove.c:1477: 
undefined reference to `find_reg_note'
libbackend.a(regmove.o)(.text+0x27c4):/ora8/sources/gcc-build/gcc/../../gcc-3.3.3/gcc/regmove.c:1478: 
undefined reference to `remove_note'
libbackend.a(regmove.o)(.text+0x32f9): In function `fixup_match_1':
/ora8/sources/gcc-build/gcc/../../gcc-3.3.3/gcc/regmove.c:1686: 
undefined reference to `find_reg_note'
libbackend.a(regmove.o)(.text+0x3496):/ora8/sources/gcc-build/gcc/../../gcc-3.3.3/gcc/regmove.c:1752: 
undefined reference to `reg_set_p'
libbackend.a(regmove.o)(.text+0x34af):/ora8/sources/gcc-build/gcc/../../gcc-3.3.3/gcc/regmove.c:1752: 
undefined reference to `reg_set_p'
libbackend.a(regmove.o)(.text+0x34da):/ora8/sources/gcc-build/gcc/../../gcc-3.3.3/gcc/regmove.c:1752: 
undefined reference to `reg_overlap_mentioned_p'
libbackend.a(regmove.o)(.text+0x34f8):/ora8/sources/gcc-build/gcc/../../gcc-3.3.3/gcc/regmove.c:1759: 
undefined reference to `find_regno_note'
libbackend.a(regmove.o)(.text+0x3556):/ora8/sources/gcc-build/gcc/../../gcc-3.3.3/gcc/regmove.c:1776: 
undefined reference to `reg_overlap_mentioned_p'
libbackend.a(regmove.o)(.text+0x35b5):/ora8/sources/gcc-build/gcc/../../gcc-3.3.3/gcc/regmove.c:1790: 
undefined reference to `reg_overlap_mentioned_p'
libbackend.a(regmove.o)(.text+0x35ca):/ora8/sources/gcc-build/gcc/../../gcc-3.3.3/gcc/regmove.c:1790: 
undefined reference to `reg_set_p'
libbackend.a(regmove.o)(.text+0x3619):/ora8/sources/gcc-build/gcc/../../gcc-3.3.3/gcc/regmove.c:1795: 
undefined reference to `single_set_2'
libbackend.a(regmove.o)(.text+0x3687):/ora8/sources/gcc-build/gcc/../../gcc-3.3.3/gcc/regmove.c:1796: 
undefined reference to `find_reg_note'
libbackend.a(regmove.o)(.text+0x370d):/ora8/sources/gcc-build/gcc/../../gcc-3.3.3/gcc/regmove.c:1808: 
undefined reference to `single_set_2'
libbackend.a(regmove.o)(.text+0x3755):/ora8/sources/gcc-build/gcc/../../gcc-3.3.3/gcc/regmove.c:1808: 
undefined reference to `single_set_2'
libbackend.a(regmove.o)(.text+0x37ad):/ora8/sources/gcc-build/gcc/../../gcc-3.3.3/gcc/regmove.c:1808: 
undefined reference to `single_set_2'
libbackend.a(regmove.o)(.text+0x38dd):/ora8/sources/gcc-build/gcc/../../gcc-3.3.3/gcc/regmove.c:1859: 
undefined reference to `reg_overlap_mentioned_p'
libbackend.a(regmove.o)(.text+0x3903):/ora8/sources/gcc-build/gcc/../../gcc-3.3.3/gcc/regmove.c:1861: 
undefined reference to `reg_overlap_mentioned_p'
libbackend.a(regmove.o)(.text+0x3920):/ora8/sources/gcc-build/gcc/../../gcc-3.3.3/gcc/regmove.c:1869: 
undefined reference to `find_reg_note'
libbackend.a(regmove.o)(.text+0x398a):/ora8/sources/gcc-build/gcc/../../gcc-3.3.3/gcc/regmove.c:1891: 
undefined reference to `remove_note'
libbackend.a(regmove.o)(.text+0x3a30):/ora8/sources/gcc-build/gcc/../../gcc-3.3.3/gcc/regmove.c:1909: 
undefined reference to `remove_note'
libbackend.a(regmove.o)(.text+0x3ac3):/ora8/sources/gcc-build/gcc/../../gcc-3.3.3/gcc/regmove.c:1935: 
undefined reference to `find_reg_note'
libbackend.a(regmove.o)(.text+0x3baf):/ora8/sources/gcc-build/gcc/../../gcc-3.3.3/gcc/regmove.c:1955: 
undefined reference to `reg_set_p'
libbackend.a(regmove.o)(.text+0x3bed):/ora8/sources/gcc-build/gcc/../../gcc-3.3.3/gcc/regmove.c:1957: 
undefined reference to `single_set_2'
libbackend.a(regmove.o)(.text+0x3c19):/ora8/sources/gcc-build/gcc/../../gcc-3.3.3/gcc/regmove.c:1960: 
undefined reference to `reg_overlap_mentioned_p'
libbackend.a(regmove.o)(.text+0x3d95):/ora8/sources/gcc-build/gcc/../../gcc-3.3.3/gcc/regmove.c:2027: 
undefined reference to `reg_overlap_mentioned_p'
libbackend.a(regmove.o)(.text+0x3dcb):/ora8/sources/gcc-build/gcc/../../gcc-3.3.3/gcc/regmove.c:2037: 
undefined reference to `remove_note'
libbackend.a(regmove.o)(.text+0x406f): In function 
`stable_and_no_regs_but_for_p':
/ora8/sources/gcc-build/gcc/../../gcc-3.3.3/gcc/regmove.c:2102: 
undefined reference to `rtx_unstable_p'
libbackend.a(regmove.o)(.text+0x4169): In function `single_set_for_csa':
/ora8/sources/gcc-build/gcc/../../gcc-3.3.3/gcc/regmove.c:2187: 
undefined reference to `single_set_2'
libbackend.a(regmove.o)(.text+0x441d): In function `record_stack_memrefs':
/ora8/sources/gcc-build/gcc/../../gcc-3.3.3/gcc/regmove.c:2308: 
undefined reference to `reg_mentioned_p'
libbackend.a(regmove.o)(.text+0x4726): In function 
`combine_stack_adjustments_for_block':
/ora8/sources/gcc-build/gcc/../../gcc-3.3.3/gcc/regmove.c:2450: 
undefined reference to `reg_mentioned_p'
libbackend.a(regmove.o)(.text+0x47e7):/ora8/sources/gcc-build/gcc/../../gcc-3.3.3/gcc/regmove.c:2481: 
undefined reference to `for_each_rtx'
libbackend.a(regmove.o)(.text+0x4821):/ora8/sources/gcc-build/gcc/../../gcc-3.3.3/gcc/regmove.c:2491: 
undefined reference to `reg_mentioned_p'
libbackend.a(sched-deps.o)(.text+0x58): In function `deps_may_trap_p':
/ora8/sources/gcc-build/gcc/../../gcc-3.3.3/gcc/sched-deps.c:108: 
undefined reference to `rtx_addr_can_trap_p'
libbackend.a(sched-deps.o)(.text+0x297): In function `add_dependence':
/ora8/sources/gcc-build/gcc/../../gcc-3.3.3/gcc/sched-deps.c:208: 
undefined reference to `modified_in_p'
libbackend.a(sched-deps.o)(.text+0x2ac):/ora8/sources/gcc-build/gcc/../../gcc-3.3.3/gcc/sched-deps.c:208: 
undefined reference to `modified_in_p'
libbackend.a(sched-deps.o)(.text+0x1b81): In function `sched_analyze_2':
/ora8/sources/gcc-build/gcc/../../gcc-3.3.3/gcc/sched-deps.c:809: 
undefined reference to `rtx_varies_p'
libbackend.a(sched-deps.o)(.text+0x1ff7): In function `sched_analyze_insn':
/ora8/sources/gcc-build/gcc/../../gcc-3.3.3/gcc/sched-deps.c:967: 
undefined reference to `find_reg_note'
libbackend.a(sched-deps.o)(.text+0x30d1):/ora8/sources/gcc-build/gcc/../../gcc-3.3.3/gcc/sched-deps.c:1201: 
undefined reference to `single_set_2'
libbackend.a(sched-deps.o)(.text+0x32b4): In function `sched_analyze':
/ora8/sources/gcc-build/gcc/../../gcc-3.3.3/gcc/sched-deps.c:1283: 
undefined reference to `find_reg_note'
libbackend.a(sched-deps.o)(.text+0x35b1):/ora8/sources/gcc-build/gcc/../../gcc-3.3.3/gcc/sched-deps.c:1385: 
undefined reference to `find_reg_note'
libbackend.a(sched-deps.o)(.text+0x3609):/ora8/sources/gcc-build/gcc/../../gcc-3.3.3/gcc/sched-deps.c:1385: 
undefined reference to `single_set_2'
libbackend.a(sched-deps.o)(.text+0x364a):/ora8/sources/gcc-build/gcc/../../gcc-3.3.3/gcc/sched-deps.c:1385: 
undefined reference to `find_reg_note'
libbackend.a(sched-deps.o)(.text+0x3660):/ora8/sources/gcc-build/gcc/../../gcc-3.3.3/gcc/sched-deps.c:1385: 
undefined reference to `find_reg_note'
libbackend.a(ssa-ccp.o)(.text+0x665): In function `visit_expression':
/ora8/sources/gcc-build/gcc/../../gcc-3.3.3/gcc/ssa-ccp.c:272: undefined 
reference to `single_set_2'
libbackend.a(ssa-ccp.o)(.text+0x1a19): In function 
`ssa_ccp_substitute_constants':
/ora8/sources/gcc-build/gcc/../../gcc-3.3.3/gcc/ssa-ccp.c:859: undefined 
reference to `single_set_2'
libbackend.a(ssa-ccp.o)(.text+0x214a): In function `mark_references':
/ora8/sources/gcc-build/gcc/../../gcc-3.3.3/gcc/ssa-ccp.c:1129: 
undefined reference to `for_each_rtx'
libbackend.a(ssa-ccp.o)(.text+0x22f9): In function `ssa_fast_dce':
/ora8/sources/gcc-build/gcc/../../gcc-3.3.3/gcc/ssa-ccp.c:1167: 
undefined reference to `side_effects_p'
libbackend.a(ssa-ccp.o)(.text+0x23f5):/ora8/sources/gcc-build/gcc/../../gcc-3.3.3/gcc/ssa-ccp.c:1204: 
undefined reference to `for_each_rtx'
libbackend.a(ssa-dce.o)(.text+0x3fb): In function 
`inherently_necessary_register':
/ora8/sources/gcc-build/gcc/../../gcc-3.3.3/gcc/ssa-dce.c:334: undefined 
reference to `for_each_rtx'
libbackend.a(ssa-dce.o)(.text+0x513): In function 
`find_inherently_necessary':
/ora8/sources/gcc-build/gcc/../../gcc-3.3.3/gcc/ssa-dce.c:387: undefined 
reference to `computed_jump_p'
libbackend.a(ssa-dce.o)(.text+0x546):/ora8/sources/gcc-build/gcc/../../gcc-3.3.3/gcc/ssa-dce.c:391: 
undefined reference to `note_stores'
libbackend.a(ssa-dce.o)(.text+0xa61): In function `ssa_eliminate_dead_code':
/ora8/sources/gcc-build/gcc/../../gcc-3.3.3/gcc/ssa-dce.c:560: undefined 
reference to `for_each_rtx'
collect2: ld returned 1 exit status
make[2]: *** [cc1] Error 1
make[2]: Leaving directory `/ora8/sources/gcc-build/gcc'
make[1]: *** [stage1_build] Error 2
make[1]: Leaving directory `/ora8/sources/gcc-build/gcc'
make: *** [bootstrap] Error 2

A lot of undefined reference to ... Really I don't understand this 
errors, I was reading gcc, make manuals and the like to try to 
understand this thing without success, please if someone can point me to 
the right reading or some part, I was looking/searching in the archived 
mailing list messages without sucess as well.

Thanks in advance.
 

-- 
 (o_   Pablo Wolter
 //\   Usuario #284649
 V_/_  Linux 2.6.8




More information about the lfs-support mailing list