make -k check error in GCC-3.4.1

Jeremy Utley jeremy at jutley.org
Tue Dec 28 18:54:08 PST 2004


joe wrote:

>hi all,
>host: Fedora 2 (kernel 2.6.9)
>LFS 6, LFS book 6.
>
>When I get to ch 6.13 (make -k check), I get some messages that isn't
>similar with
>http://gcc.gnu.org/ml/gcc-testresults/2004-07/msg00179.html.
>
>I've already repeated 3 times building chapter 6, FYI I accidently delete
>the source and build directories in chap 5.
>I'd glad if one could gimme the clue of these errors.
>
>Here is some quoted messages that I suspect :
>.
>.
>...
>                === libstdc++ Summary ===
>
># of expected passes            2696
># of unexpected successes       1
># of expected failures          5
>make[3]: *** [check-DEJAGNU] Error 1          <<<====== !!!!
>
>                === libstdc++-v3 check-abi Summary ===
>
># of added symbols:              298
># of missing symbols:            284
># of incompatible symbols:       284
>
>using:
>/sources/gcc-3.4.1/libstdc++-v3/config/abi/i486-linux-gnu/baseline_symbols.txt
>make[3]: Leaving directory
>`/sources/gcc-build/i686-pc-linux-gnu/libstdc++-v3/testsuite'
>make[2]: *** [check-am] Error 2                <<<===== !!!!
>make[2]: Target `check' not remade because of errors.
>make[2]: Leaving directory
>`/sources/gcc-build/i686-pc-linux-gnu/libstdc++-v3/testsuite'
>make[2]: Entering directory
>`/sources/gcc-build/i686-pc-linux-gnu/libstdc++-v3'
>.
>.
>.
>make[3]: Leaving directory
>`/sources/gcc-build/i686-pc-linux-gnu/libstdc++-v3'
>make[2]: Leaving directory
>`/sources/gcc-build/i686-pc-linux-gnu/libstdc++-v3'
>make[1]: *** [check-recursive] Error 1        <<<===== !!!!
>make[1]: Target `check' not remade because of errors.
>make[1]: Leaving directory
>`/sources/gcc-build/i686-pc-linux-gnu/libstdc++-v3'
>make: *** [check-target-libstdc++-v3] Error 2  <<<==== !!!!
>make[1]: Entering directory
>`/sources/gcc-build/i686-pc-linux-gnu/libiberty' make[2]: Entering
>directory
>`/sources/gcc-build/i686-pc-linux-gnu/libiberty/testsuite'
>make[2]: Nothing to be done for `check'.
>make[2]: Leaving directory
>`/sources/gcc-build/i686-pc-linux-gnu/libiberty/testsuite'
>make[1]: Leaving directory
>`/sources/gcc-build/i686-pc-linux-gnu/libiberty' make: Target `check' not
>remade because of errors.
>
>
>Any suggestion ? I suspect I do wrong installing dejaGNU in chapter 5.
>But how to reinstall dejaGNU in chp 5then go back to chapter 6?
>
>thx in advance.
>---
>desperajoe
>  
>
Errors in the gcc testsuite are expected.  That's why we use the -k 
parameter to make, so it continues after errors, and why we post results 
on the web you can compare with.  Please do so.

-J-



More information about the lfs-support mailing list