Chapter 5 GCC Pass 2 libstdc++-v3 make failure

Mark Carey markcare at paradise.net.nz
Fri Apr 23 17:54:37 PDT 2004


Hi, 
 
Following V5 of the book trying to build GCC 3.3.1, patches applied, 2nd pass. 
Last issued command ``make'' pg 79. 
 
Host: 
Knoppix v3.2 (knoppix lang=us) 
Uname reports Linux 2.4.20-xfs 
 
Deviations: 
tcl8.4.6 
expect-5.40 (patched with expect-5.39.0-spawn.patch, patch appeared to apply 
cleanly) 
 
Test Failures: 
glibc - None 
tcl - Minor ones where couldnt write to ram disk (fCmd-6.26) 
      all.tcl:        Total 10514 Passed 9635 Skipped 878 Failed  1 
      Files with failing tests: fCmd.test 
expect - None 
 
Error: 
/mnt/lfs/sources/gcc-build/gcc/xgcc -shared-libgcc 
-B/mnt/lfs/sources/gcc-build/gcc/ -nostdinc++ 
-L/mnt/lfs/sources/gcc-build/i686-pc-linux-gnu/libstdc++-v3/src 
-L/mnt/lfs/sources/gcc-build/i686-pc-linux-gnu/libstdc++-v3/src/.libs 
-B/tools/i686-pc-linux-gnu/bin/ -B/tools/i686-pc-linux-gnu/lib/ -isystem 
/tools/i686-pc-linux-gnu/include -nostdinc++ 
-I/mnt/lfs/sources/gcc-build/i686-pc-linux-gnu/libstdc++-v3/include/i686-pc-linux-gnu 
-I/mnt/lfs/sources/gcc-build/i686-pc-linux-gnu/libstdc++-v3/include 
-I../../../../gcc-3.3.1/libstdc++-v3/libsupc++ 
-I../../../../gcc-3.3.1/libstdc++-v3/libmath -g -O2 -D_GNU_SOURCE 
-fno-implicit-templates -Wall -Wno-format -W -Wwrite-strings 
-fdiagnostics-show-location=once -ffunction-sections -fdata-sections -c 
../../../../gcc-3.3.1/libstdc++-v3/src/string-inst.cc -o string-inst.o 
>/dev/null 2>&1 
make[3]: *** [string-inst.lo] Error 1 
make[3]: Leaving directory 
`/mnt/lfs/sources/gcc-build/i686-pc-linux-gnu/libstdc++-v3/src' 
make[2]: *** [all-recursive] Error 1 
make[2]: Leaving directory 
`/mnt/lfs/sources/gcc-build/i686-pc-linux-gnu/libstdc++-v3' 
make[1]: *** [all-recursive-am] Error 2 
make[1]: Leaving directory 
`/mnt/lfs/sources/gcc-build/i686-pc-linux-gnu/libstdc++-v3' 
make: *** [all-target-libstdc++-v3] Error 2 
 
Any suggestions? 
 
Thanks, 
 
 
Mark Carey 
 



More information about the lfs-support mailing list