when i build make-3.80, i got error

wang wang at dev.riso.co.jp
Thu Nov 27 01:59:32 PST 2003


I am using CVS-20031119 to building my linux system. The base system is
redhat7.2.
When I build make-3.80 and use make check, I got the error messages as
following:
......
Finding tests...
......
functions/origin.......FAILED
......
1 Test Failed (see .diff files in work dir for details) :-(
make[2]: *** [check-regression] Error 1
make[2]: Leaving directory `/mnt/lfs/sources/make-3.80`
make[1]: *** [check-am] Error 2
make[1]: Leaving directory `/mnt/lfs/sources/make-3.80`
make: *** [check-recursive] Error 1

pls tell me why and how to solve it. thanks




More information about the lfs-support mailing list