when i build make-3.80, i get this error message, why?

wang wang at dev.riso.co.jp
Thu Nov 27 01:27:47 PST 2003


hi, i am according lfs book accurately to build my linux system, but when i
build my make-3.80, i got an error, pls tell me why and how to solve it.
thanks.

when i use "make check" it says:

......
Finding tests...
......
functions/origin..............FAILED
......
1 Test Failed (see .diff files in work dir for details) :-(
make[2]: *** [check-regression] Error 1
make[2]: Leaving directory `/mnt/lfs/sources/make-3.80`
make[1]: *** [check-am] Error 2
make[1]: Leaving directory `/mnt/lfs/sources/make-3.80`
make: *** [check-recursive]  Error 1

yongning wang




More information about the lfs-support mailing list