problem with tst-gettext, and various errors

tqbfjotld tqbfjotld at free.fr
Sun Nov 23 14:21:22 PST 2003


Hello,

I use LFS 5.0 with the tarball downloaded on the linuxfromscratch.org site.

I use nALS 1.1.8.

I use the latest profile.

My box is a Mandrake 9.1 one.

I successfully installed LFS 4.1 manually and I wanted to use ALFS for
LFS 5.0.


I have the following error :
-: flt-32 -I../sysdeps/ieee754 -I../sysdeps/generic/elf 
-I../sysdeps/generic  -nostdinc -isystem /tools/lib/gc
c-lib/i686-pc-linux-gnu/3.3.1/include -isystem /usr/include 
-D_LIBC_REENTRANT -include ../include/libc-symbols
.h   -DNOT_IN_libc=1    -D'LOCALEDIR="/usr/share/locale"' 
-D'LOCALE_ALIAS_PATH="/usr/share/locale"' -o /tools/
build/glibc-build/intl/tst-gettext.o
-: gcc -nostdlib -nostartfiles -o 
/tools/build/glibc-build/intl/tst-gettext  -Wl,-dynamic-linker=/lib/ld-linux
.so.2   -Wl,-z,combreloc /tools/build/glibc-build/csu/crt1.o 
/tools/build/glibc-build/csu/crti.o `gcc --print-
file-name=crtbegin.o` /tools/build/glibc-build/intl/tst-gettext.o 
-Wl,-rpath-link=/tools/build/glibc-build:/t
ools/build/glibc-build/math:/tools/build/glibc-build/elf:/tools/build/glibc-build/dlfcn:/tools/build/glibc-bui
ld/nss:/tools/build/glibc-build/nis:/tools/build/glibc-build/rt:/tools/build/glibc-build/resolv:/tools/build/g
libc-build/crypt:/tools/build/glibc-build/linuxthreads 
/tools/build/glibc-build/libc.so.6 /tools/build/glibc-b
uild/libc_nonshared.a -lgcc `gcc --print-file-name=crtend.o` 
/tools/build/glibc-build/csu/crtn.o
-: /bin/sh -e tst-gettext.sh /tools/build/glibc-build/ 
/tools/build/glibc-build/intl/ \
-:   /tools/build/glibc-build/intl/tst-gettext.mtrace
-: make[2]: *** [/tools/build/glibc-build/intl/tst-gettext.out] Error 1
-: make[2]: Leaving directory `/tools/build/glibc-2.3.2/intl'
-: make[1]: *** [intl/tests] Error 2
-: make[1]: Leaving directory `/tools/build/glibc-2.3.2'
-: make: *** [check] Error 2
I: Sending the package log to the frontend...
I: Log file stored in "/root/.nALFS/packages/glibc-2.3.2.log".

And here is the /tools/build/glibc-build/intl/tst-gettext.out file :

test `gettext' with LANGUAGE set
test `gettext' with LANGUAGE set
test `dgettext' with LANGUAGE set
test `gettext' with LC_ALL set
test `gettext' with LC_ALL deciding
test `dgettext' with LC_ALL deciding
test `gettext' with LC_ALL set
test `gettext' with LC_xxx deciding
test `dgettext' with LC_xxx deciding
test `dcgettext' with category == LC_MESSAGES
test `dcgettext' with LANGUAGE == LC_TIME
test `dcgettext' with LANGUAGE == LC_NUMERIC
tst-gettext.c:215: setlocale (LC_ALL, ""): No such file or directory
test `gettext' with LANG set
test `gettext' with LANG set
test `dgettext' with LANG set

Any idea of what is going wrong ?

When reading nalfs.log, I can see various Error 1 messages like :

-: make[2]: [stage1-start] Error 1 (ignored)
-: mv intl/*.o stage1/intl
-: mv: cannot stat `intl/*.o': No such file or directory
-: make[2]: [stage1-start] Error 1 (ignored)

during build of gcc

and like :

-: mkdir /tools/libexec
-: /usr/bin/install -c -m 4755 -o root 
/mnt/lfs/tools/build/glibc-build/login/pt_chown /tools/libexec/pt_chown
-: /usr/bin/install: cannot change ownership of 
`/tools/libexec/pt_chown': Operation not permitted
-: make[2]: [/tools/libexec/pt_chown] Error 1 (ignored)
later.

and during the build of ncurse :
-: linking libncurses.so.5.3 to libcurses.so
-: cd /tools/lib && (rm -f libcurses.so; ln -s libncurses.so.5.3 
libcurses.so; )
-: test -z "" && /sbin/ldconfig
-: /sbin/ldconfig: Can't create temporary cache file /etc/ld.so.cache~: 
Permission denied
-: make[1]: [install] Error 1 (ignored)


Regards,

tqbfjotld.
"The Quick Brown Fox Jumps Over The Lazy Dog"




More information about the lfs-support mailing list