Binutils - Pass 2

Greg Schafer gschafer at zip.com.au
Wed Nov 19 14:22:36 PST 2003


On Wed, Nov 19, 2003 at 09:20:11AM -0300, Dar?o Bravo wrote:
> Hello to everyone! I had a problem with the 'make check' command for the
> second stage of binutils install. The command presented something like:
> 
> ./test-demangle <
> ../../../binutils-2.14/libiberty/testsuite/demangle-expected
> ./test-demangle: /lib/libc.so.6: version `GLIBC_2.3' not found (required
> by ./test-demangle)
> make[3]: *** [check-cplus-dem] Error 1
> make[3]: Leaving directory
> `/mnt/lfs/packages/binutils-build/libiberty/testsuite'
> make[2]: *** [check-subdir] Error 2
> make[2]: Leaving directory `/mnt/lfs/packages/binutils-build/libiberty'
> make[1]: *** [check-libiberty] Error 2
> make[1]: Leaving directory `/mnt/lfs/packages/binutils-build'
> make: *** [check] Error 2

It would appear that maybe you forgot to apply the gcc specs patch in the
gcc pass 2 which was the previous package.



More information about the lfs-support mailing list