grep compilation test error

llista llista at ya.com
Sun Nov 16 03:57:24 PST 2003


Hi, I hope you just can read my error because I've pasted it, not attached.

when I've just make a compilation on grep, I test the commpilation using 
make check and i get the next error message

May anybody help me?


Making check in intl
make[1]: Entering directory `/mnt/lfs/sources/codi/grep-2.5/intl'
make[1]: Nothing to be done for `check'.
make[1]: Leaving directory `/mnt/lfs/sources/codi/grep-2.5/intl'
Making check in po
make[1]: Entering directory `/mnt/lfs/sources/codi/grep-2.5/po'
PATH=../src:$PATH : --default-domain=grep --directory=.. \
 --add-comments --keyword=_ --keyword=N_ \
 --files-from=./POTFILES.in \
&& test ! -f grep.po \
  || ( rm -f ./grep.pot \
    && mv grep.po ./grep.pot )
file=./`echo cs | sed 's,.*/,,'`.gmo \
 && rm -f $file && PATH=../src:$PATH : -o $file cs.po
file=./`echo de | sed 's,.*/,,'`.gmo \
 && rm -f $file && PATH=../src:$PATH : -o $file de.po
file=./`echo el | sed 's,.*/,,'`.gmo \
 && rm -f $file && PATH=../src:$PATH : -o $file el.po
file=./`echo eo | sed 's,.*/,,'`.gmo \
 && rm -f $file && PATH=../src:$PATH : -o $file eo.po
file=./`echo es | sed 's,.*/,,'`.gmo \
 && rm -f $file && PATH=../src:$PATH : -o $file es.po
file=./`echo et | sed 's,.*/,,'`.gmo \
 && rm -f $file && PATH=../src:$PATH : -o $file et.po
file=./`echo fr | sed 's,.*/,,'`.gmo \
 && rm -f $file && PATH=../src:$PATH : -o $file fr.po
file=./`echo gl | sed 's,.*/,,'`.gmo \
 && rm -f $file && PATH=../src:$PATH : -o $file gl.po
file=./`echo hr | sed 's,.*/,,'`.gmo \
 && rm -f $file && PATH=../src:$PATH : -o $file hr.po
file=./`echo id | sed 's,.*/,,'`.gmo \
 && rm -f $file && PATH=../src:$PATH : -o $file id.po
file=./`echo it | sed 's,.*/,,'`.gmo \
 && rm -f $file && PATH=../src:$PATH : -o $file it.po
file=./`echo ja | sed 's,.*/,,'`.gmo \
 && rm -f $file && PATH=../src:$PATH : -o $file ja.po
file=./`echo ko | sed 's,.*/,,'`.gmo \
 && rm -f $file && PATH=../src:$PATH : -o $file ko.po
file=./`echo nl | sed 's,.*/,,'`.gmo \
 && rm -f $file && PATH=../src:$PATH : -o $file nl.po
file=./`echo no | sed 's,.*/,,'`.gmo \
 && rm -f $file && PATH=../src:$PATH : -o $file no.po
file=./`echo pl | sed 's,.*/,,'`.gmo \
 && rm -f $file && PATH=../src:$PATH : -o $file pl.po
file=./`echo pt_BR | sed 's,.*/,,'`.gmo \
 && rm -f $file && PATH=../src:$PATH : -o $file pt_BR.po
file=./`echo ru | sed 's,.*/,,'`.gmo \
 && rm -f $file && PATH=../src:$PATH : -o $file ru.po
file=./`echo sl | sed 's,.*/,,'`.gmo \
 && rm -f $file && PATH=../src:$PATH : -o $file sl.po
file=./`echo sv | sed 's,.*/,,'`.gmo \
 && rm -f $file && PATH=../src:$PATH : -o $file sv.po
make[1]: Leaving directory `/mnt/lfs/sources/codi/grep-2.5/po'
Making check in lib
make[1]: Entering directory `/mnt/lfs/sources/codi/grep-2.5/lib'
Making check in posix
make[2]: Entering directory `/mnt/lfs/sources/codi/grep-2.5/lib/posix'
make[2]: Nothing to be done for `check'.
make[2]: Leaving directory `/mnt/lfs/sources/codi/grep-2.5/lib/posix'
make[2]: Entering directory `/mnt/lfs/sources/codi/grep-2.5/lib'
make[2]: Nothing to be done for `check-am'.
make[2]: Leaving directory `/mnt/lfs/sources/codi/grep-2.5/lib'
make[1]: Leaving directory `/mnt/lfs/sources/codi/grep-2.5/lib'
Making check in doc
make[1]: Entering directory `/mnt/lfs/sources/codi/grep-2.5/doc'
make[1]: Nothing to be done for `check'.
make[1]: Leaving directory `/mnt/lfs/sources/codi/grep-2.5/doc'
Making check in src
make[1]: Entering directory `/mnt/lfs/sources/codi/grep-2.5/src'
make[1]: Nothing to be done for `check'.
make[1]: Leaving directory `/mnt/lfs/sources/codi/grep-2.5/src'
Making check in tests
make[1]: Entering directory `/mnt/lfs/sources/codi/grep-2.5/tests'
make  check-TESTS
make[2]: Entering directory `/mnt/lfs/sources/codi/grep-2.5/tests'
/bin/sh: line 1: ./warning.sh: Permission denied
FAIL: warning.sh
/bin/sh: line 1: ./khadafy.sh: Permission denied
FAIL: khadafy.sh
/bin/sh: line 1: ./spencer1.sh: Permission denied
FAIL: spencer1.sh
/bin/sh: line 1: ./bre.sh: Permission denied
FAIL: bre.sh
/bin/sh: line 1: ./ere.sh: Permission denied
FAIL: ere.sh
/bin/sh: line 1: ./status.sh: Permission denied
FAIL: status.sh
/bin/sh: line 1: ./empty.sh: Permission denied
FAIL: empty.sh
/bin/sh: line 1: ./options.sh: Permission denied
FAIL: options.sh
PASS: backref.sh
PASS: file.sh
====================
8 of 10 tests failed
====================
make[2]: *** [check-TESTS] Error 1
make[2]: Leaving directory `/mnt/lfs/sources/codi/grep-2.5/tests'
make[1]: *** [check-am] Error 2
make[1]: Leaving directory `/mnt/lfs/sources/codi/grep-2.5/tests'
make: *** [check-recursive] Error 1




More information about the lfs-support mailing list