gcc pass one fails to make

Peter -lastfuture- Marquardt lastfuture at lastfuture.de
Wed Nov 12 13:31:25 PST 2003


I am having trouble building the first pass of the gcc package. the book
and the packages tar is version 5.0 and i am using jeremy's bootable lfs
cd.

it happens when doing: make BOOT_LDFLAGS="-static" bootstrap
after a significant amount of time... like perhaps 2 or 3 SBU

this is the last screen of output (probably too much but better that
than too little):

/bin/sh ../../gcc-3.3.1/gcc/move-if-change tmp-attrtab.c insn-attrtab.c
echo timestamp > s-attrtab
stage1/xgcc -Bstage1/ -B/tools/i686-pc-linux-gnu/bin/   -g -O2
-DIN_GCC   -W -Wall -Wwrite-strings -Wstrict-prototypes
-Wmissing-prototypes -Wtraditional -pedantic -Wno-long-long  
-DHAVE_CONFIG_H    -I. -I. -I../../gcc-3.3.1/gcc -I../../gcc-3.3.1/gcc/.
-I../../gcc-3.3.1/gcc/config -I../../gcc-3.3.1/gcc/../include -c
insn-attrtab.c \
  -o insn-attrtab.o
stage1/xgcc -Bstage1/ -B/tools/i686-pc-linux-gnu/bin/ -c   -g -O2
-DIN_GCC   -W -Wall -Wwrite-strings -Wstrict-prototypes
-Wmissing-prototypes -Wtraditional -pedantic -Wno-long-long  
-DHAVE_CONFIG_H -DGENERATOR_FILE    -I. -I. -I../../gcc-3.3.1/gcc
-I../../gcc-3.3.1/gcc/. -I../../gcc-3.3.1/gcc/config
-I../../gcc-3.3.1/gcc/../include ../../gcc-3.3.1/gcc/genemit.c -o
genemit.o
stage1/xgcc -Bstage1/ -B/tools/i686-pc-linux-gnu/bin/   -g -O2
-DIN_GCC   -W -Wall -Wwrite-strings -Wstrict-prototypes
-Wmissing-prototypes -Wtraditional -pedantic -Wno-long-long  
-DHAVE_CONFIG_H -DGENERATOR_FILE -static -o genemit \
 genemit.o rtl.o read-rtl.o bitmap.o ggc-none.o gensupport.o
insn-conditions.o print-rtl1.o \
    errors.o ../libiberty/libiberty.a
./genemit ../../gcc-3.3.1/gcc/config/i386/i386.md > tmp-emit.c
/bin/sh ../../gcc-3.3.1/gcc/move-if-change tmp-emit.c insn-emit.c
echo timestamp > s-emit
stage1/xgcc -Bstage1/ -B/tools/i686-pc-linux-gnu/bin/   -g -O2
-DIN_GCC   -W -Wall -Wwrite-strings -Wstrict-prototypes
-Wmissing-prototypes -Wtraditional -pedantic -Wno-long-long  
-DHAVE_CONFIG_H    -I. -I. -I../../gcc-3.3.1/gcc -I../../gcc-3.3.1/gcc/.
-I../../gcc-3.3.1/gcc/config -I../../gcc-3.3.1/gcc/../include -c
insn-emit.c \
  -o insn-emit.o
/tmp/ccap5tAr.s: Assembler messages:
/tmp/ccap5tAr.s:86539: Error: unknown pseudo-op: `.bytei0x20'
make[2]: *** [insn-emit.o] Error 1
make[2]: Leaving directory `/mnt/lfs/sources/gcc-build/gcc'
make[1]: *** [stage2_build] Error 2
make[1]: Leaving directory `/mnt/lfs/sources/gcc-build/gcc'
make: *** [bootstrap] Error 2
lfs at lfs-cd /mnt/lfs/sources/gcc-build>

it seems to fail on reproducing itself but i am far from being an expert
so i count on your help.

i have retried it following the book several times, always emptying the
gcc-build dir and restarting from the beginning of the page of the book.

help is very appreciated

--lasty

-- 
web: www.lastfuture.de - finest homegrown music
key: http://www.lastfuture.de/permanent/lastfuture.asc
-------------- next part --------------
A non-text attachment was scrubbed...
Name: signature.asc
Type: application/pgp-signature
Size: 189 bytes
Desc: This is a digitally signed message part
URL: <http://lists.linuxfromscratch.org/pipermail/lfs-support/attachments/20031112/b0970c21/attachment.sig>


More information about the lfs-support mailing list