Lfs5 ch5 coreutils error

John Toews john at academiccolab.org
Thu Nov 6 14:50:50 PST 2003


Hi all,

I'm having a problem running the 'make RUN_EXPENSIVE_TESTS=yes check'
command during the chapter 5 step using Coreutils 5.0. (note that make
check runs fine)

Note I am no Linux expert. I didn't seem to encounter any unexpected
errors in my earlier builds using LFS as a guide. I am running debian
3.0 as the host on a p3 500. I am wondering if the error is simply that
the partition doesn't have 4gb free? (it is a 3gb partition)

Thanks,
John Toews

--------------------

I get the following on my screen (let me know if there are more details
in a file somewhere):

make[3]: Entering directory
'/mnt/lfs/sources/coreutils-5.0/tests/tail-2'
Dd: advancing past 4294967288 bytes in output file 'big': Invalid
argument ./big-4gb: failure in testing framework

... snip ...

1 of 5 tests failed

... snip ...

make[3]: *** [check-TESTS] Error 1
make[3]: Leaving directory '/mnt/lfs/sources/coreutils-5.0/tests/tail-2'
make[2]: *** [check-am] Error 2
make[2]: Leaving directory '/mnt/lfs/sources/coreutils-5.0/tests/tail-2'
make[1]: *** [check-recursive] Error 1
make[1]: Leaving directory '/mnt/lfs/sources/coreutils-5.0/tests'
make: *** [check-recursive] Error 1



More information about the lfs-support mailing list