trouble with Installing GCC-3.3.1 - Pass 2

Rocky Jones rocky at northwestern.edu
Mon Nov 3 13:23:53 PST 2003


Hi -

I'm building LFS 5.0PRE3 using knoppix 2.4.5, and in chapter 5, during
Installing GCC-3.3.1 - Pass 2, I receive errors which I cannot figure out
myself:

lfs at 0[glibc-2.3.2]$ make

<cut>

touch stamp-ofiles
/bin/sh ./libtool --mode=link
gcc -W -Wall -Wstrict-prototypes -Wmissing-prototypes -g -O2  -o
libbfd.la -rpath /tools/lib -release 2.14  archive.lo archures.lo bfd.lo
bfdio.lo bfdwin.lo cache.lo coffgen.lo corefile.lo format.lo init.lo
libbfd.lo opncls.lo reloc.lo section.lo syms.lo targets.lo hash.lo linker.lo
srec.lo binary.lo tekhex.lo ihex.lo stabs.lo stab-syms.lo merge.lo dwarf2.lo
simple.lo archive64.lo `cat ofiles` -L../libiberty/pic -liberty
./libtool: line 1: cd: ../libiberty/pic: No such file or directory
libtool: link: cannot determine absolute directory name of
`../libiberty/pic'
make[3]: *** [libbfd.la] Error 1
make[3]: Leaving directory `/mnt/lfs/sources/binutils-build/bfd'
make[2]: *** [all-recursive] Error 1
make[2]: Leaving directory `/mnt/lfs/sources/binutils-build/bfd'
make[1]: *** [all-recursive-am] Error 2
make[1]: Leaving directory `/mnt/lfs/sources/binutils-build/bfd'
make: *** [all-bfd] Error 2

Thanks for any help!
Rocky Jones




More information about the lfs-support mailing list