gcc 3.2 compile errors

kaiyi lin kaiyilin at compuserve.de
Tue Oct 22 02:04:55 PDT 2002

I just built gcc 3.2 once again with fresh source code.
Interesting but also very frustrating that I got this time
totally different error msg. (I actually did it 2 times today and 2 
times this error msg)

stage2/xgcc -Bstage2/ -B/static/i586-pc-linux-gnu/bin/ -c -DIN_GCC    -g 
-O2 -W -Wall -Wwrite-strings -Wstrict-prototypes -Wmissing-prototypes 
-Wtraditional -pedantic -Wno-long-long  -DHAVE_CONFIG_H    -I. -I. 
-I../../gcc-3.2/gcc -I../../gcc-3.2/gcc/. -I../../gcc-3.2/gcc/config 
-I../../gcc-3.2/gcc/../include \
         ../../gcc-3.2/gcc/config/i386/i386.c -o i386.o
../../gcc-3.2/gcc/config/i386/i386.c: In function 
../../gcc-3.2/gcc/config/i386/i386.c:3335: internal error: Segmentation 
Please submit a full bug report,
with preprocessed source if appropriate.
See <URL:http://www.gnu.org/software/gcc/bugs.html> for instructions.
make[2]: *** [i386.o] Error 1
make[2]: Leaving directory `/LFS/static/src/gcc-build/gcc'
make[1]: *** [stage3_build] Error 2
make[1]: Leaving directory `/LFS/static/src/gcc-build/gcc'
make: *** [bootstrap] Error 2

This time it seems to get problem in i386.c. I just typed the same
command codes written in book Chapter 5. Bad RAM?

Unsubscribe: send email to listar at linuxfromscratch.org
and put 'unsubscribe lfs-support' in the subject header of the message

More information about the lfs-support mailing list