LFS 4.0 rc1: GCC-3.2 Chapter 5 Compilation error on fixincl.c

Thx528 plavenu at hotmail.com
Mon Oct 14 13:30:57 PDT 2002

Hello guys,

 From my brand new mandrake 9.0, I try to build a LFS system with the 
4.0rc1 following line by line the LFS book.
According to LFS-SUPPORT, I have download and patch my gcc package with 
In chapter 5, when I try to install gcc-3.2 I have the following error:
../../../gcc-3.2/gcc/fixinc/fixincl.c:584: too few arguments to function 
make[3]: *** [fixincl.o] Error 1
make[3]: Leaving directory `/lfs/usr/src/gcc-build/gcc/fixinc'
make[2]: *** [fixinc.sh] Error 2
make[2]: Leaving directory `/lfs/usr/src/gcc-build/gcc'
make[1]: *** [stage1_build] Error 2
make[1]: Leaving directory `/lfs/usr/src/gcc-build/gcc'
make: *** [bootstrap] Error 2

Any idea?
Thank you in advance for your help,

Unsubscribe: send email to listar at linuxfromscratch.org
and put 'unsubscribe lfs-support' in the subject header of the message

More information about the lfs-support mailing list