Textutils compiling error

Eric . ege75 at hotmail.com
Sat Oct 12 12:47:54 PDT 2002


Hi everybody :)
I'm trying to install LFS 4.0 but I have a problem when compiling 
textutils-2.1.
Ih have this message during the compilation:

make[3]: Leaving directory `/static/src/textutils-2.1/tests/tac'
Making all in tail
make[3]: Entering directory `/static/src/textutils-2.1/tests/tail'
rm -f Makefile.am Makefile.amt
sed -n '1,/^##test-files-begin/p' ../Makefile.am.in > Makefile.amt
tool=`echo tests/tail|sed 's/^tests.//;s/-test//'`; \
  echo "x = $tool" >> Makefile.amt
/missing perl -I. -w -- ./../mk-script --list >> Makefile.amt
/bin/sh: /missing: No such file or directory
make[3]: *** [Makefile.am] Error 127
make[3]: Leaving directory `/static/src/textutils-2.1/tests/tail'
make[2]: *** [all-recursive] Error 1
make[2]: Leaving directory `/static/src/textutils-2.1/tests'
make[1]: *** [all-recursive] Error 1
make[1]: Leaving directory `/static/src/textutils-2.1'
make: *** [all] Error 2


Could anyone help me please ? :)

Thanks, Eric :)


_________________________________________________________________
Join the world’s largest e-mail service with MSN Hotmail. 
http://www.hotmail.com

-- 
Unsubscribe: send email to listar at linuxfromscratch.org
and put 'unsubscribe lfs-support' in the subject header of the message



More information about the lfs-support mailing list