Error while compiling texinfo-4.2

Sebastian Friedel webmaster at trekplace.de
Tue Oct 8 08:52:22 PDT 2002


Hi, i'm currently reading the pdf version of lfs 4.0.

I did everything as mentioned in the book, but when it comes to compile
texinfo-4.2 in chapter 5 an error occurs.

### Output of stderr
/usr/bin/ld: Warning: size of symbol `ospeed' changed from 2 to 4 in
lib_tputs.o
collect2: ld returned 1 exit status
make[3]: *** [ginfo] Error 1
make[2]: *** [all] Error 2
make[1]: *** [all-recursive] Error 1
make: *** [all] Error 2
### End Output

I don't know if this is enough for you to find the problem. If it isn't
enough, i can also post the last 10 (of as much as you need) lines of the
stdout


Hope you'll find my problem

Thx for your help


-- 
Unsubscribe: send email to listar at linuxfromscratch.org
and put 'unsubscribe lfs-support' in the subject header of the message



More information about the lfs-support mailing list